3-Hexene, 2,5-dimethyl-
- Formula: C8H16
- Molecular weight: 112.2126
- IUPAC Standard InChIKey: KNCMKWVOMRUHKZ-UHFFFAOYSA-N
- CAS Registry Number: 15910-22-2
- Chemical structure:
View 3d structure (requires JavaScript / HTML 5) - Stereoisomers:
- Other names: 2,5-Dimethyl-3-hexene

Phase change data

Data compiled by: Thermodynamics Research Center, NIST Boulder Laboratories, Chris Muzny director
Quantity | Value | Units | Method | Reference | Comment |
---|---|---|---|---|---|
Tboil | 374.9 | K | N/A | Brace, 1955 | Uncertainty assigned by TRC = 3. K |

References

Brace, 1955
Brace, N.O.,
The uncatalyzed thermal addition of formaldehyde to olefins,
J. Am. Chem. Soc., 1955, 77, 4666. [all data]