Trimethylene glycol monomethyl ether

Phase change data

Data compiled by: Thermodynamics Research Center, NIST Boulder Laboratories, Chris Muzny director

Quantity Value Units Method Reference Comment
Tboil421.65KN/ASmith and Sprung, 1943Uncertainty assigned by TRC = 2. K

In addition to the Thermodynamics Research Center (TRC) data available from this site, much more physical and chemical property data is available from the following TRC products:

References

Smith and Sprung, 1943
Smith, L.I.; Sprung, J.A., Vitamin E. XLI. Synthesis of 1-Chloro-3,7,11,15-tetramethyl- hexadecanol-3, and its Condensation with Trimethylhydroquinone to Form α-Tocopherol, J. Am. Chem. Soc., 1943, 65, 1276. [all data]