2-Butanol
- Formula: C4H10O
- Molecular weight: 74.1216
- IUPAC Standard InChIKey: BTANRVKWQNVYAZ-UHFFFAOYSA-N
- CAS Registry Number: 15892-23-6
- Chemical structure:
View 3d structure (requires JavaScript / HTML 5) - Species with the same structure:
- Stereoisomers:
- Other names: sec-Butyl Alcohol; sec-Butanol; CCS 301; Ethyl methyl carbinol; Methyl ethyl carbinol; 1-Methyl-1-propanol; 1-Methylpropyl alcohol; 2-Hydroxybutane; sec-C4H9OH; Butane, 2-hydroxy-; Butanol-2; Butan-2-ol; 2-Butyl alcohol; s-Butyl alcohol; Butylene hydrate; DL-sec-Butanol; DL-2-Butanol; Alcool butylique secondaire; Butanol secondaire; s-Butanol; 1-Methyl propanol; n-Butan-2-ol; NSC 25499; 2-Butanol, (.+/-.)-

Gas phase thermochemistry data

Data compiled by: Hussein Y. Afeefy, Joel F. Liebman, and Stephen E. Stein
Quantity | Value | Units | Method | Reference | Comment |
---|---|---|---|---|---|
ΔfH°gas | -292.7 ± 0.3 | kJ/mol | Ccr | Steele, Chirico, et al., 1991 |

Condensed phase thermochemistry data

Data compiled by: Hussein Y. Afeefy, Joel F. Liebman, and Stephen E. Stein
Quantity | Value | Units | Method | Reference | Comment |
---|---|---|---|---|---|
ΔfH°liquid | -342.6 ± 0.3 | kJ/mol | Ccr | Steele, Chirico, et al., 1991 | |
Quantity | Value | Units | Method | Reference | Comment |
ΔcH°liquid | -2660.59 ± 0.18 | kJ/mol | Ccr | Steele, Chirico, et al., 1991 | Corresponding ΔfHºliquid = -342.60 kJ/mol (simple calculation by NIST; no Washburn corrections) |

Phase change data

Data compiled as indicated in comments:
BS - Robert L. Brown and Stephen E. Stein
ALS - Hussein Y. Afeefy, Joel F. Liebman, and Stephen E. Stein
Quantity | Value | Units | Method | Reference | Comment |
---|---|---|---|---|---|
Tboil | 371.2 | K | N/A | Aldrich Chemical Company Inc., 1990 | BS |
Tboil | 372.7 | K | N/A | Weast and Grasselli, 1989 | BS |
Quantity | Value | Units | Method | Reference | Comment |
ΔvapH° | 49.86 ± 0.03 | kJ/mol | V | Steele, Chirico, et al., 1991 | ALS |

References

Steele, Chirico, et al., 1991
Steele, W.V.; Chirico, R.D.; Nguyen, A.; Hossenlopp, I.A.; Smith, N.K.,
DIPPR PROJECT 871: Determination of ideal-gas enthalpies of formation for key compounds: The 1989 project results,
J. Chem. Thermodyn., 1991, 101-134. [all data]
Aldrich Chemical Company Inc., 1990
Aldrich Chemical Company Inc.,
Catalog Handbook of Fine Chemicals, Aldrich Chemical Company, Inc., Milwaukee WI, 1990, 1. [all data]
Weast and Grasselli, 1989
CRC Handbook of Data on Organic Compounds, 2nd Editon, Weast,R.C and Grasselli, J.G., ed(s)., CRC Press, Inc., Boca Raton, FL, 1989, 1. [all data]