Cyclopentane, 1,2,3-trimethyl-, (1α,2α,3β)-
- Formula: C8H16
- Molecular weight: 112.2126
- IUPAC Standard InChIKey: VCWNHOPGKQCXIQ-RNFRBKRXSA-N
- CAS Registry Number: 15890-40-1
- Chemical structure:
View 3d structure (requires JavaScript / HTML 5) - Species with the same structure:
- Stereoisomers:
- Other names: Cyclopentane, 1,2,3-trimethyl-, cis-1,2,trans-1,3-; trans,cis-1,2,3-Trimethylcyclopentane; 1,2,3-Trimethylcyclopentane, cis, trans; 1,2,3-Trimethylcyclopentane, trans, cis; 1-cis-2, trans-3-Trimethylcyclopentane; 1,trans-2,cis-3-Trimethylcyclopentane; Cyclopentane, 1,2,3-trimethyl-, cis,trans; Cyclopentane, 1,2,3-trimethyl-, trans, cis; 1-trans-2-trans-3-Trimethylcyclopentane; cis 1,2-trans-3-trimethylcyclopentane

Phase change data

Data compiled as indicated in comments:
TRC - Thermodynamics Research Center, NIST Boulder Laboratories, Chris Muzny director
AC - William E. Acree, Jr., James S. Chickos
Quantity | Value | Units | Method | Reference | Comment |
---|---|---|---|---|---|
Tboil | 390.7 | K | N/A | Glasgow, Gordon, et al., 1957 | Uncertainty assigned by TRC = 2. K; TRC |
Tboil | 391.3 | K | N/A | Koperina and Kazanskii, 1948 | Uncertainty assigned by TRC = 0.7 K; TRC |
Tboil | 390.35 | K | N/A | Fenske, Braun, et al., 1947 | Uncertainty assigned by TRC = 0.3 K; TRC |
Tboil | 391.3 | K | N/A | Kazanskii, Koperina, et al., 1947 | Uncertainty assigned by TRC = 2. K; TRC |
Quantity | Value | Units | Method | Reference | Comment |
Tfus | 160.25 | K | N/A | Streiff, Murphy, et al., 1946 | Uncertainty assigned by TRC = 0.2 K; TRC |
Quantity | Value | Units | Method | Reference | Comment |
ΔvapH° | 38.1 | kJ/mol | N/A | Reid, 1972 | AC |

Kovats' RI, non-polar column, isothermal

View large format table.

Column type Active phase Temperature (C) I Reference Comment
CapillaryOV-1010.738.Skrbic, 1997
CapillaryCP Sil 260.750.8Estel, Mohnke, et al., 1995100. m/0.25 mm/0.25 μm
CapillaryOV-10140.744.Laub and Purnell, 1988
CapillaryOV-10160.748.Laub and Purnell, 1988
CapillaryOV-10180.753.Laub and Purnell, 1988
CapillarySqualane50.777.9Lunskii and Paizanskaya, 1988He; Column length: 50. m; Column diameter: 0.22 mm
CapillarySqualane70.782.7Lunskii and Paizanskaya, 1988He; Column length: 50. m; Column diameter: 0.22 mm
CapillaryNonpolar45.747.Stoyanov and Dimov, 1987
CapillaryNonpolar52.5748.Stoyanov and Dimov, 1987
CapillaryNonpolar60.750.Stoyanov and Dimov, 1987
CapillaryOV-10140.745.3Boneva and Dimov, 1986100. m/0.27 mm/0.9 μm
CapillaryOV-10150.747.1Boneva and Dimov, 1986100. m/0.27 mm/0.9 μm
CapillaryOV-10160.748.9Boneva and Dimov, 1986100. m/0.27 mm/0.9 μm
CapillaryOV-10170.750.9Boneva and Dimov, 1986100. m/0.27 mm/0.9 μm
CapillarySqualane50.747.8Krupcik, Cellar, et al., 1986Column length: 180. m; Column diameter: 0.25 mm
CapillarySqualane50.778.8Krupcik, Cellar, et al., 1986Column length: 180. m; Column diameter: 0.25 mm
CapillaryOV-10130.742.Chien, Furio, et al., 1983
CapillaryOV-10140.744.Chien, Furio, et al., 1983
CapillaryOV-10150.746.Chien, Furio, et al., 1983
CapillaryOV-10160.748.Chien, Furio, et al., 1983
CapillaryOV-10170.750.Chien, Furio, et al., 1983
CapillaryOV-10180.752.Chien, Furio, et al., 1983
CapillaryDB-160.779.Lubeck and Sutton, 1983Column length: 60. m; Column diameter: 0.264 mm
CapillaryDB-160.779.2Lubeck and Sutton, 198360. m/0.259 mm/1. μm
CapillaryDB-160.749.4Lubeck and Sutton, 1983Column length: 60. m; Column diameter: 0.264 mm
CapillaryDB-160.749.6Lubeck and Sutton, 198360. m/0.259 mm/1. μm
CapillaryOV-10150.747.Johansen and Ettre, 1982100. m/0.27 mm/0.20 μm
CapillaryOV-10150.747.Johansen and Ettre, 198255. m/0.27 mm/0.9 μm
CapillarySF-9650.747.Johansen and Ettre, 198291.4 m/0.31 mm/0.20 μm
CapillarySqualane70.783.1Nabivach and Kirilenko, 1979N2; Column length: 50. m
CapillarySqualane100.738.4Lulova, Leont'eva, et al., 1976He; Column length: 120. m; Column diameter: 0.25 mm
CapillarySqualane100.780.2Lulova, Leont'eva, et al., 1976He; Column length: 120. m; Column diameter: 0.25 mm
CapillaryVacuum Grease Oil (VM-4)35.772.Sidorov, Petrova, et al., 1972
CapillaryVacuum Grease Oil (VM-4)45.775.Sidorov, Petrova, et al., 1972
CapillaryVacuum Grease Oil (VM-4)50.776.Sidorov, Petrova, et al., 1972
CapillaryVacuum Grease Oil (VM-4)58.779.Sidorov, Petrova, et al., 1972
CapillaryVacuum Grease Oil (VM-4)68.782.Sidorov, Petrova, et al., 1972
PackedVacuum Grease Oil (VM-4)35.775.Sidorov, Ivanova, et al., 1971
PackedSE-30130.798.Mitra and Saha, 1970N2, Chromosorb W; Column length: 6.1 m
PackedSqualane27.774.Hively and Hinton, 1968He, Chromosorb P; Column length: 15. m; Column diameter: 0.25 mm
PackedSqualane49.779.Hively and Hinton, 1968He, Chromosorb P; Column length: 15. m; Column diameter: 0.25 mm
PackedSqualane67.783.Hively and Hinton, 1968He, Chromosorb P; Column length: 15. m; Column diameter: 0.25 mm
PackedSqualane86.788.Hively and Hinton, 1968He, Chromosorb P; Column length: 15. m; Column diameter: 0.25 mm

Kovats' RI, non-polar column, custom temperature program

View large format table.

Column type Active phase I Reference Comment
CapillaryPetrocol DH-100772.7Haagen-Smit Laboratory, 1997He; Column length: 100. m; Column diameter: 0.2 mm; Program: 5C(10min) => 5C/min => 50C(48min) => 1.5C/min => 195C(91min)

Van Den Dool and Kratz RI, non-polar column, temperature ramp

View large format table.

Column type Active phase I Reference Comment
CapillaryOV-101775.0Yin, Liu, et al., 2001N2, 1. K/min; Column length: 80. m; Column diameter: 0.22 mm; Tstart: 30. C; Tend: 130. C
CapillaryOV-101744.9Yin, Liu, et al., 2001N2, 1. K/min; Column length: 80. m; Column diameter: 0.22 mm; Tstart: 30. C; Tend: 130. C
CapillaryPetrocol DH742.04Subramaniam, Bochniak, et al., 1994100. m/0.25 mm/0.5 μm, He, 1. K/min; Tstart: 30. C; Tend: 220. C
CapillaryUltra-1774.Olson, Sinkevitch, et al., 19924. K/min; Tstart: -40. C; Tend: 230. C

Normal alkane RI, non-polar column, isothermal

View large format table.

Column type Active phase Temperature (C) I Reference Comment
CapillarySqualane100.789.Krupcik, Cellar, et al., 1986, 2Column length: 180. m; Column diameter: 0.25 mm
CapillarySqualane40.776.Krupcik, Cellar, et al., 1986, 2Column length: 180. m; Column diameter: 0.25 mm
CapillarySqualane70.783.Krupcik, Cellar, et al., 1986, 2Column length: 180. m; Column diameter: 0.25 mm
CapillarySqualane100.756.Krupcik, Cellar, et al., 1986, 2Column length: 180. m; Column diameter: 0.25 mm
CapillarySqualane40.746.Krupcik, Cellar, et al., 1986, 2Column length: 180. m; Column diameter: 0.25 mm
CapillarySqualane70.751.Krupcik, Cellar, et al., 1986, 2Column length: 180. m; Column diameter: 0.25 mm
CapillarySqualane86.743.Vigdergauz and Martynov, 1971He; Column length: 150. m; Column diameter: 0.35 mm
CapillarySqualane86.780.Vigdergauz and Martynov, 1971He; Column length: 150. m; Column diameter: 0.35 mm
CapillarySqualane86.736.Vigdergauz and Martynov, 1971He; Column length: 150. m; Column diameter: 0.35 mm

Normal alkane RI, non-polar column, temperature ramp

View large format table.

Column type Active phase I Reference Comment
CapillarySqualane747.2Krupcik, Cellar, et al., 19860.1 K/min; Column length: 100. m; Column diameter: 0.25 mm
CapillarySqualane748.1Krupcik, Cellar, et al., 19860.2 K/min; Column length: 100. m; Column diameter: 0.25 mm
CapillarySqualane749.5Krupcik, Cellar, et al., 19860.4 K/min; Column length: 100. m; Column diameter: 0.25 mm
CapillarySqualane750.7Krupcik, Cellar, et al., 19860.6 K/min; Column length: 100. m; Column diameter: 0.25 mm
CapillarySqualane751.6Krupcik, Cellar, et al., 19860.8 K/min; Column length: 100. m; Column diameter: 0.25 mm
CapillarySqualane752.7Krupcik, Cellar, et al., 19861. K/min; Column length: 100. m; Column diameter: 0.25 mm
CapillarySqualane778.2Krupcik, Cellar, et al., 19860.1 K/min; Column length: 100. m; Column diameter: 0.25 mm
CapillarySqualane779.6Krupcik, Cellar, et al., 19860.2 K/min; Column length: 100. m; Column diameter: 0.25 mm
CapillarySqualane781.9Krupcik, Cellar, et al., 19860.4 K/min; Column length: 100. m; Column diameter: 0.25 mm
CapillarySqualane783.7Krupcik, Cellar, et al., 19860.6 K/min; Column length: 100. m; Column diameter: 0.25 mm
CapillarySqualane785.2Krupcik, Cellar, et al., 19860.8 K/min; Column length: 100. m; Column diameter: 0.25 mm
CapillarySqualane786.5Krupcik, Cellar, et al., 19861. K/min; Column length: 100. m; Column diameter: 0.25 mm
CapillarySqualane778.Krupcik, Cellar, et al., 1986, 20.1 K/min; Column length: 180. m; Column diameter: 0.25 mm; Tstart: 40. C
CapillarySqualane775.Krupcik, Cellar, et al., 1986, 20.2 K/min; Column length: 180. m; Column diameter: 0.25 mm; Tstart: 40. C
CapillarySqualane782.Krupcik, Cellar, et al., 1986, 20.4 K/min; Column length: 180. m; Column diameter: 0.25 mm; Tstart: 40. C
CapillarySqualane783.Krupcik, Cellar, et al., 1986, 20.6 K/min; Column length: 180. m; Column diameter: 0.25 mm; Tstart: 40. C
CapillarySqualane785.Krupcik, Cellar, et al., 1986, 20.8 K/min; Column length: 180. m; Column diameter: 0.25 mm; Tstart: 40. C
CapillarySqualane786.Krupcik, Cellar, et al., 1986, 21.0 K/min; Column length: 180. m; Column diameter: 0.25 mm; Tstart: 40. C
CapillarySqualane747.Krupcik, Cellar, et al., 1986, 20.1 K/min; Column length: 180. m; Column diameter: 0.25 mm; Tstart: 40. C
CapillarySqualane748.Krupcik, Cellar, et al., 1986, 20.2 K/min; Column length: 180. m; Column diameter: 0.25 mm; Tstart: 40. C
CapillarySqualane749.Krupcik, Cellar, et al., 1986, 20.4 K/min; Column length: 180. m; Column diameter: 0.25 mm; Tstart: 40. C
CapillarySqualane750.Krupcik, Cellar, et al., 1986, 20.6 K/min; Column length: 180. m; Column diameter: 0.25 mm; Tstart: 40. C
CapillarySqualane751.Krupcik, Cellar, et al., 1986, 20.8 K/min; Column length: 180. m; Column diameter: 0.25 mm; Tstart: 40. C
CapillarySqualane752.Krupcik, Cellar, et al., 1986, 21.0 K/min; Column length: 180. m; Column diameter: 0.25 mm; Tstart: 40. C

Normal alkane RI, non-polar column, custom temperature program

View large format table.

Column type Active phase I Reference Comment
CapillaryMethyl Silicone772.Spieksma, 1999Program: not specified

References

Glasgow, Gordon, et al., 1957
Glasgow, A.R.; Gordon, R.J.; Willingham, C.B.; Mair, B.J.; Rossini, F.D.,
Hydrocarbons in the 116 deg C to 126 deg C Fraction of Petroleum,
Anal. Chem., 1957, 29, 357. [all data]
Koperina and Kazanskii, 1948
Koperina, A.V.; Kazanskii, B.A.,
1,2,3-TRimethylcyclpentane,
Izv. Akad. Nauk S.S.S.R., 1948, 1948, 302-10. [all data]
Fenske, Braun, et al., 1947
Fenske, M.R.; Braun, W.G.; Wiegand, R.V.; Quiggle, D.; McCormick, R.H.; Rank, D.H.,
Raman Spectra of Hydrocarbons,
Anal. Chem., 1947, 19, 700. [all data]
Kazanskii, Koperina, et al., 1947
Kazanskii, B.A.; Koperina, A.V.; Batu'ev, M.I.,
Synthesis and Properties of Stereoisomeric 1,2,4-Trimethylcyclopentanes,
Doklady Akad. Nauk S.S.S.R., 1947, 56, 819-22. [all data]
Streiff, Murphy, et al., 1946
Streiff, A.J.; Murphy, E.T.; Cahill, J.C.; Soule, L.F.; Sedlak, V.A.; Willingham, C.B.; Rossini, F.D.,
, Am. Pet. Inst. Res. Proj. 6, unpublished, Natl. Bur. Stand., 1946. [all data]
Reid, 1972
Reid, Robert C.,
Handbook on vapor pressure and heats of vaporization of hydrocarbons and related compounds, R. C. Wilhort and B. J. Zwolinski, Texas A Research Foundation. College Station, Texas(1971). 329 pages.$10.00,
AIChE J., 1972, 18, 6, 1278-1278, https://doi.org/10.1002/aic.690180637
. [all data]