Cyclohexanol, trans-4-(1-methylethyl)
- Formula: C9H18O
- Molecular weight: 142.2386
- IUPAC Standard InChIKey: DKKRDMLKVSKFMJ-KYZUINATSA-N
- CAS Registry Number: 15890-36-5
- Chemical structure:
View 3d structure (requires JavaScript / HTML 5) - Stereoisomers:
- Other names: Cyclohexanol, 4-(1-methylethyl)-, trans-; trans-4-(1-methylethyl)cyclohexanol

Phase change data

Data compiled by: Thermodynamics Research Center, NIST Boulder Laboratories, Chris Muzny director
Quantity | Value | Units | Method | Reference | Comment |
---|---|---|---|---|---|
Tboil | 484. | K | N/A | Stork and White, 1956 | Uncertainty assigned by TRC = 2. K |

Kovats' RI, non-polar column, isothermal

Column type | Active phase | Temperature (C) | I | Reference | Comment |
---|---|---|---|---|---|
Packed | Apiezon L | 130. | 1173. | Paris and Alexandre, 1972 | Chromosorb W AW |

References

Stork and White, 1956
Stork, G.; White, W.N.,
The Stereochemistry of the SN2' Reaction II.,
J. Am. Chem. Soc., 1956, 78, 4609. [all data]
Paris and Alexandre, 1972
Paris, C.; Alexandre, P.,
Stereochemical Investigation of Cyclohexane and Terpene Compounds by Gas Chromatography,
J. Chromatogr. Sci., 1972, 10, 6, 402-411, https://doi.org/10.1093/chromsci/10.6.402
. [all data]