1,2-dimethyl-4-butylbenzene
- Formula: C12H18
- Molecular weight: 162.2713
- IUPAC Standard InChIKey: GDWDJSONXTXOEE-UHFFFAOYSA-N
- CAS Registry Number: 15880-21-4
- Chemical structure:
View 3d structure (requires JavaScript / HTML 5) - Permanent link for this species. Use this link for bookmarking this species for future reference.

Phase change data

Data compiled by: Thermodynamics Research Center, NIST Boulder Laboratories, Chris Muzny director
Quantity | Value | Units | Method | Reference | Comment |
---|---|---|---|---|---|
Tboil | 485. | K | N/A | Mekhtiev and Lyushin, 1966 | Uncertainty assigned by TRC = 1. K |

References

Mekhtiev and Lyushin, 1966
Mekhtiev, S.D.; Lyushin, M.M.,
Azerb. Khim. Zh., 1966, No. 5, 21-5. [all data]