4-heptadecyloxybenzoic acid
- Formula: C24H40O3
- Molecular weight: 376.5726
- IUPAC Standard InChIKey: BVLMZJDPRGABBN-UHFFFAOYSA-N
- CAS Registry Number: 15872-49-8
- Chemical structure:
View 3d structure (requires JavaScript / HTML 5) - Permanent link for this species. Use this link for bookmarking this species for future reference.

Phase change data

Data compiled by: Thermodynamics Research Center, NIST Boulder Laboratories, Chris Muzny director
Quantity | Value | Units | Method | Reference | Comment |
---|---|---|---|---|---|
Tfus | 377. | K | N/A | Herbert, 1967 | Smectic liquid crystal phase; Uncertainty assigned by TRC = 1. K |

References

Herbert, 1967
Herbert, A.J.,
Transition temperatures and transition energies of the p-n-alkoxy benzoic acids, from n-propyl to n-octadecyl,
Trans. Faraday Soc., 1967, 63, 555, https://doi.org/10.1039/tf9676300555
. [all data]