4-Hexadecyloxybenzoic acid

Phase change data

Data compiled by: Thermodynamics Research Center, NIST Boulder Laboratories, Chris Muzny director

Quantity Value Units Method Reference Comment
Tfus375.KN/AHerbert, 1967Smectic liquid crystal phase; Uncertainty assigned by TRC = 1. K

In addition to the Thermodynamics Research Center (TRC) data available from this site, much more physical and chemical property data is available from the following TRC products:

References

Herbert, 1967
Herbert, A.J., Transition temperatures and transition energies of the p-n-alkoxy benzoic acids, from n-propyl to n-octadecyl, Trans. Faraday Soc., 1967, 63, 555, https://doi.org/10.1039/tf9676300555 . [all data]