p-Nonyloxybenzoic acid
- Formula: C16H24O3
- Molecular weight: 264.3600
- IUPAC Standard InChIKey: BOZLUAUKDKKZHJ-UHFFFAOYSA-N
- CAS Registry Number: 15872-43-2
- Chemical structure:
View 3d structure (requires JavaScript / HTML 5) - Other names: 4-n-Nonyloxybenzoic acid

Phase change data

Data compiled by: Thermodynamics Research Center, NIST Boulder Laboratories, Chris Muzny director
Quantity | Value | Units | Method | Reference | Comment |
---|---|---|---|---|---|
Tfus | 365.2 | K | N/A | Herbert, 1967 | Smectic liquid crystal phase; Uncertainty assigned by TRC = 1. K |

References

Herbert, 1967
Herbert, A.J.,
Transition temperatures and transition energies of the p-n-alkoxy benzoic acids, from n-propyl to n-octadecyl,
Trans. Faraday Soc., 1967, 63, 555, https://doi.org/10.1039/tf9676300555
. [all data]