4-Heptyloxybenzoic acid
- Formula: C14H20O3
- Molecular weight: 236.3068
- IUPAC Standard InChIKey: ZRVIYEJYXIDATJ-UHFFFAOYSA-N
- CAS Registry Number: 15872-42-1
- Chemical structure:
View 3d structure (requires JavaScript / HTML 5) - Other names: p-Heptyloxybenzoic acid; p-n-Heptyloxybenzoic acid; Benzoic acid, 4-(heptyloxy)-; p-Heptoxybenzoic acid; Benzoic acid, p-(heptyloxy)-

Phase change data

Data compiled by: Thermodynamics Research Center, NIST Boulder Laboratories, Chris Muzny director
Quantity | Value | Units | Method | Reference | Comment |
---|---|---|---|---|---|
Tfus | 367. | K | N/A | Herbert, 1967 | Smectic liquid crystal phase; Uncertainty assigned by TRC = 1. K |

References

Herbert, 1967
Herbert, A.J.,
Transition temperatures and transition energies of the p-n-alkoxy benzoic acids, from n-propyl to n-octadecyl,
Trans. Faraday Soc., 1967, 63, 555, https://doi.org/10.1039/tf9676300555
. [all data]