4-Pentyloxybenzoic acid
- Formula: C12H16O3
- Molecular weight: 208.2536
- IUPAC Standard InChIKey: OZPPUPJQRJYTNY-UHFFFAOYSA-N
- CAS Registry Number: 15872-41-0
- Chemical structure:
View 3d structure (requires JavaScript / HTML 5) - Other names: p-Pentyloxybenzoic acid; 4-n-Amyloxybenzoic acid; p-n-Amyloxybenzoic acid; p-n-Pentyloxybenzoic acid; p-Pentoxybenzoic acid; Benzoic acid, p-(pentyloxy)-; Benzoic acid, 4-(pentyloxy)-

Phase change data

Data compiled by: Thermodynamics Research Center, NIST Boulder Laboratories, Chris Muzny director
Quantity | Value | Units | Method | Reference | Comment |
---|---|---|---|---|---|
Tfus | 398. | K | N/A | Herbert, 1967 | Nemactic liquid crystal phase; Uncertainty assigned by TRC = 1. K |

References

Herbert, 1967
Herbert, A.J.,
Transition temperatures and transition energies of the p-n-alkoxy benzoic acids, from n-propyl to n-octadecyl,
Trans. Faraday Soc., 1967, 63, 555, https://doi.org/10.1039/tf9676300555
. [all data]