4,4-Dimethyl octane
- Formula: C10H22
- Molecular weight: 142.2817
- IUPAC Standard InChIKey: ZMEDGZAGMLTROM-UHFFFAOYSA-N
- CAS Registry Number: 15869-95-1
- Chemical structure:
View 3d structure (requires JavaScript / HTML 5) - Other names: Octane, 4,4-dimethyl-

Phase change data

Data compiled as indicated in comments:
BS - Robert L. Brown and Stephen E. Stein
TRC - Thermodynamics Research Center, NIST Boulder Laboratories, Chris Muzny director
AC - William E. Acree, Jr., James S. Chickos
Quantity | Value | Units | Method | Reference | Comment |
---|---|---|---|---|---|
Tboil | 430.7 | K | N/A | Weast and Grasselli, 1989 | BS |
Tboil | 428. | K | N/A | Petrov, Sushchinskii, et al., 1957 | Uncertainty assigned by TRC = 2. K; TRC |
Tboil | 426.15 | K | N/A | Chel'tsova, Chernyshev, et al., 1955 | Uncertainty assigned by TRC = 3. K; TRC |
Tboil | 430.65 | K | N/A | Levina, Tantsyreva, et al., 1952 | Uncertainty assigned by TRC = 0.5 K; TRC |
Quantity | Value | Units | Method | Reference | Comment |
ΔvapH° | 48.1 | kJ/mol | N/A | Reid, 1972 | AC |

Gas phase ion energetics data

Data compiled by: Sharon G. Lias, John E. Bartmess, Joel F. Liebman, John L. Holmes, Rhoda D. Levin, and W. Gary Mallard
Appearance energy determinations
Ion | AE (eV) | Other Products | Method | Reference | Comment |
---|---|---|---|---|---|
C7H15+ | 10.20 | C3H7 | EI | Lossing and Holmes, 1984 | |
C9H19+ | 10.10 | CH3 | EI | Lossing and Holmes, 1984 |

Kovats' RI, non-polar column, isothermal

Column type | Active phase | Temperature (C) | I | Reference | Comment |
---|---|---|---|---|---|
Capillary | Squalane | 100. | 918. | Heinzen, Soares, et al., 1999 | |
Capillary | DB-1 | 60. | 921. | Lubeck and Sutton, 1983 | Column length: 60. m; Column diameter: 0.264 mm |
Capillary | DB-1 | 60. | 921. | Lubeck and Sutton, 1983 | 60. m/0.259 mm/1. μm |
Capillary | Squalane | 60. | 918. | Chretien and Dubois, 1976 | |
Capillary | Squalane | 100. | 920. | Mitra, Mohan, et al., 1974 | H2; Column length: 50. m; Column diameter: 0.2 mm |
Capillary | Squalane | 60. | 918. | Matukuma, 1969 | N2; Column length: 91.4 m; Column diameter: 0.25 mm |
Capillary | Squalane | 80. | 921. | Schomburg, 1967 | Ar; Column length: 100. m |

Kovats' RI, non-polar column, temperature ramp

Column type | Active phase | I | Reference | Comment |
---|---|---|---|---|
Capillary | OV-101 | 920. | Hayes and Pitzer, 1982 | 110. m/0.25 mm/0.20 μm, He, 1. K/min; Tstart: 35. C; Tend: 200. C |

Kovats' RI, non-polar column, custom temperature program

Column type | Active phase | I | Reference | Comment |
---|---|---|---|---|
Capillary | DB-1 | 930. | Hoekman, 1993 | 60. m/0.32 mm/1.0 μm, He; Program: -40 C for 12 min; -40 - 125 C at 3 deg.min; 125-185 C at 6 deg/min; 185 - 220 C at 20 deg/min; hold 220 C for 2 min |
Capillary | Squalane | 917. | Korol and Lysyuk, 1980 | Program: not specified |

Van Den Dool and Kratz RI, non-polar column, temperature ramp

Column type | Active phase | I | Reference | Comment |
---|---|---|---|---|
Capillary | SE-30 | 921. | Krupcík, Repka, et al., 1987 | 60. m/0.25 mm/1. μm, H2, 1. K/min; Tstart: 60. C |
Capillary | OV-101 | 920. | Hayes and Pitzer, 1981 | 108. m/0.25 mm/0.2 μm, 1. K/min; Tstart: 35. C; Tend: 200. C |

Normal alkane RI, non-polar column, isothermal

Column type | Active phase | Temperature (C) | I | Reference | Comment |
---|---|---|---|---|---|
Capillary | Apiezon L | 40. to 190. | 925. | Mann, Mühlstädt, et al., 1967 | Column length: 2. m |

Normal alkane RI, non-polar column, temperature ramp

Column type | Active phase | I | Reference | Comment |
---|---|---|---|---|
Capillary | SE-54 | 920. | Guan, Li, et al., 1995 | 60. C @ 2. min, 4. K/min; Column length: 50. m; Column diameter: 0.32 mm; Tend: 200. C |

Normal alkane RI, non-polar column, custom temperature program

Column type | Active phase | I | Reference | Comment |
---|---|---|---|---|
Capillary | OV-101 | 918. | Du and Liang, 2003 | Program: not specified |
Capillary | Polydimethyl siloxane | 918. | Junkes, Castanho, et al., 2003 | Program: not specified |
Capillary | OV-1, SE-30, Methyl silicone, SP-2100, OV-101, DB-1, etc. | 920. | Waggott and Davies, 1984 | Hydrogen; Column length: 50. m; Column diameter: 0.32 mm; Program: not specified |

References

Weast and Grasselli, 1989
CRC Handbook of Data on Organic Compounds, 2nd Editon, Weast,R.C and Grasselli, J.G., ed(s)., CRC Press, Inc., Boca Raton, FL, 1989, 1. [all data]
Petrov, Sushchinskii, et al., 1957
Petrov, A.D.; Sushchinskii, V.L.; Zakharov, E.P.; Rogozhnikova, T.I.,
Synthesis of Branched ALiphatic C10-C15 Hydrocarbons by the Grignard and the Grignard-Wurtz Reactions,
Zh. Obshch. Khim., 1957, 27, 467. [all data]
Chel'tsova, Chernyshev, et al., 1955
Chel'tsova, M.A.; Chernyshev, E.A.; Petrov, A.D.,
Behaviour of Alkenyl Halides with Unsaturated Bond in γ-, δ, ε-Postion in Condenstation Reactions with Alkyl Halides in the Presence of Magnesium,
Izv. Akad. Nauk SSSR, 1955, 1955, 522-7. [all data]
Levina, Tantsyreva, et al., 1952
Levina, R.Ya.; Tantsyreva, T.I.; Fainzil'berg, A.A.,
Synthesis of Hydrocarbons XX. Synthesis of Alkenes and Alkanes with A Quarternary Carbon Atom,
Zh. Obshch. Khim., 1952, 22, 571. [all data]
Reid, 1972
Reid, Robert C.,
Handbook on vapor pressure and heats of vaporization of hydrocarbons and related compounds, R. C. Wilhort and B. J. Zwolinski, Texas A Research Foundation. College Station, Texas(1971). 329 pages.$10.00,
AIChE J., 1972, 18, 6, 1278-1278, https://doi.org/10.1002/aic.690180637
. [all data]