Octane, 3,4-dimethyl-
- Formula: C10H22
- Molecular weight: 142.2817
- IUPAC Standard InChIKey: QQCWGAMGBCGAQJ-UHFFFAOYSA-N
- CAS Registry Number: 15869-92-8
- Chemical structure:
View 3d structure (requires JavaScript / HTML 5) - Stereoisomers:
- Other names: 3,4-Dimethyloctane

Phase change data

Data compiled by: William E. Acree, Jr., James S. Chickos
Quantity | Value | Units | Method | Reference | Comment |
---|---|---|---|---|---|
ΔvapH° | 48.1 | kJ/mol | N/A | Reid, 1972 |

Kovats' RI, non-polar column, isothermal

View large format table.

Column type Active phase Temperature (C) I Reference Comment
CapillarySqualane100.936.Heinzen, Soares, et al., 1999
CapillaryDB-160.938.9Lubeck and Sutton, 1983Column length: 60. m; Column diameter: 0.264 mm
CapillaryDB-160.939.Lubeck and Sutton, 198360. m/0.259 mm/1. μm
CapillarySqualane60.936.Chretien and Dubois, 1976
CapillarySqualane60.936.Matukuma, 1969N2; Column length: 91.4 m; Column diameter: 0.25 mm
CapillarySqualane60.936.Matukuma, 1969N2; Column length: 91.4 m; Column diameter: 0.25 mm

Normal alkane RI, non-polar column, custom temperature program

View large format table.

Column type Active phase I Reference Comment
CapillaryPolydimethyl siloxane936.Junkes, Castanho, et al., 2003Program: not specified

References

Reid, 1972
Reid, Robert C.,
Handbook on vapor pressure and heats of vaporization of hydrocarbons and related compounds, R. C. Wilhort and B. J. Zwolinski, Texas A Research Foundation. College Station, Texas(1971). 329 pages.$10.00,
AIChE J., 1972, 18, 6, 1278-1278, https://doi.org/10.1002/aic.690180637
. [all data]