ethoxydiethylaluminium
- Formula: C6H15AlO
- Molecular weight: 130.1642
- CAS Registry Number: 1586-92-1

Condensed phase thermochemistry data

Data compiled by: José A. Martinho Simões
Quantity | Value | Units | Method | Reference | Comment |
---|---|---|---|---|---|
ΔfH°liquid | -523.1 ± 5.5 | kJ/mol | Review | Martinho Simões | |
Quantity | Value | Units | Method | Reference | Comment |
ΔcH°liquid | -4819.5 ± 5.4 | kJ/mol | CC-SB | Shmyreva, Golosova, et al., 1974 | Please also see Pedley and Rylance, 1977. |

Phase change data

Data compiled as indicated in comments:
MS - José A. Martinho Simões
AC - William E. Acree, Jr., James S. Chickos
Quantity | Value | Units | Method | Reference | Comment |
---|---|---|---|---|---|
ΔvapH° | 48.7 ± 1.0 | kJ/mol | CC-SB | Shmyreva, Golosova, et al., 1974 | MS |
Enthalpy of vaporization
ΔvapH (kJ/mol) | Temperature (K) | Reference | Comment |
---|---|---|---|
48.7 ± 0.8 | 433. | Shmyreva, Golosova, et al., 1974 | Based on data from 403. to 463. K.; AC |

Gas phase thermochemistry data

Data compiled by: José A. Martinho Simões
Quantity | Value | Units | Method | Reference | Comment |
---|---|---|---|---|---|
ΔfH°gas | -113.4 ± 1.3 | kcal/mol | Review | Martinho Simões |

References

Martinho Simões
Martinho Simões, J.A.,
Private communication (see http://webbook.nist.gov/chemistry/om/). [all data]
Shmyreva, Golosova, et al., 1974
Shmyreva, G.O.; Golosova, R.M.; Sakharovskaya, G.B.; Popov, A.F.; Korneev, N.N.; Smolyaninova, A.A.,
Russ. J. Phys. Chem., 1974, 48, 447. [all data]
Pedley and Rylance, 1977
Pedley, J.B.; Rylance, J.,
Computer Analysed Thermochemical Data: Organic and Organometallic Compounds, University of Sussex, Brigton, 1977. [all data]