2-Butenal, (Z)-
- Formula: C4H6O
- Molecular weight: 70.0898
- IUPAC Standard InChIKey: MLUCVPSAIODCQM-IHWYPQMZSA-N
- CAS Registry Number: 15798-64-8
- Chemical structure:
View 3d structure (requires JavaScript / HTML 5) - Stereoisomers:
- Other names: Crotonaldehyde, (Z)-; cis-Crotonaldehyde; (2Z)-2-Butenal; (Z)-2-Butenal; (Z)-Crotonaldehyde; Crotonaldehyde

Normal alkane RI, polar column, temperature ramp

Column type | Active phase | I | Reference | Comment |
---|---|---|---|---|
Capillary | DB-Wax | 1035. | Horiuchi, Umano, et al., 1998 | 60. m/0.25 mm/1. μm, He, 3. K/min, 200. C @ 40. min; Tstart: 50. C |

References

Horiuchi, Umano, et al., 1998
Horiuchi, M.; Umano, K.; Shibamoto, T.,
Analysis of volatile compounds formed from fish oil heated with cysteine and trimethylamine oxide,
J. Agric. Food Chem., 1998, 46, 12, 5232-5237, https://doi.org/10.1021/jf980482m
. [all data]