1,5,9-Cyclododecatriene, 1-methyl-, (E,E,E)-
- Formula: C13H20
- Molecular weight: 176.2979
- IUPAC Standard InChIKey: VJHWJWRAAFGNQY-KNNXMIQQSA-N
- CAS Registry Number: 15782-27-1
- Chemical structure:
View 3d structure (requires JavaScript / HTML 5) - Stereoisomers:
- Other names: 1-Methyl-1,5,9-cyclododecatriene-, (E,E,E)-; (E,E,E)-1,5,9-Cyclododecatriene, 1-methyl

Kovats' RI, non-polar column, isothermal

Column type | Active phase | Temperature (C) | I | Reference | Comment |
---|---|---|---|---|---|
Capillary | Squalane | 120. | 1345. | Schomburg, 1967 | Ar; Column length: 100. m |

References

Schomburg, 1967
Schomburg, G.,
Struktur und Retentionsverhalten von Offenkettigen und Cyclischen Kohlenwasserstoffen und Deren Einfacher Substitutionsprodukte,
Anal. Chim. Acta., 1967, 38, 45-64, https://doi.org/10.1016/S0003-2670(01)80560-2
. [all data]