(Z)-2-pentenal

Normal alkane RI, non-polar column, temperature ramp

Data compiled by: NIST Mass Spectrometry Data Center, William E. Wallace, director

Column type Capillary
Active phase HP-1
Column length (m) 50.
Carrier gas N2
Substrate
Column diameter (mm) 0.2
Phase thickness (μm) 0.33
Tstart (C) 60.
Tend (C) 250.
Heat rate (K/min) 2.
Initial hold (min)
Final hold (min) 20.
I 727.
ReferenceBerlioz, Cordella, et al., 2006
Comment MSDC-RI

References

Berlioz, Cordella, et al., 2006
Berlioz, B.; Cordella, C.; Cavalli, J.-F.; Lizzani-Cuvelier, L.; Loiseau, A.-M.; Fernandez, X., Comparison of the amounts of volatile compounds in French protected designation of origin virgin olive oils, J. Agric. Food Chem., 2006, 54, 26, 10092-10101, https://doi.org/10.1021/jf061796+ . [all data]