CH3C(O)O(CH2)3CH=CH2
- Formula: C7H12O2
- Molecular weight: 128.1690
- IUPAC Standard InChIKey: LVHDNIMNOMRZMF-UHFFFAOYSA-N
- CAS Registry Number: 1576-85-8
- Chemical structure:
View 3d structure (requires JavaScript / HTML 5) - Other names: 4-Penten-1-yl acetate; 5-Acetoxy-1-pentene; 4-Penten-1-ol acetate; 4-Pentenyl acetate; pent-4-ene-1-yl acetate

Phase change data

Data compiled by: Robert L. Brown and Stephen E. Stein
Quantity | Value | Units | Method | Reference | Comment |
---|---|---|---|---|---|
Tboil | 418.2 | K | N/A | Aldrich Chemical Company Inc., 1990 |

Van Den Dool and Kratz RI, non-polar column, temperature ramp

Column type | Active phase | I | Reference | Comment |
---|---|---|---|---|
Capillary | SE-30 | 861. | Korhonen, 1984 | N2, 6. K/min; Column length: 25. m; Column diameter: 0.30 mm; Tstart: 50. C |

Van Den Dool and Kratz RI, non-polar column, custom temperature program

Column type | Active phase | I | Reference | Comment |
---|---|---|---|---|
Capillary | VF-5MS | 901.9 | Tret'yakov, 2008 | 30. m/0.25 mm/0.25 μm, He; Program: Multi-step temperature program; T(initial)=60C; T(final)=270C |
Capillary | BPX-5 | 890. | Bauchot, Mottram, et al., 1998 | 50. m/0.32 mm/0.50 μm, He; Program: 0 0C (8 min) -> (1 min) -> 50 0C (2 min) 2.5 0C/min -> 100 0C 6 0C/min -> 250 0C |

Van Den Dool and Kratz RI, polar column, temperature ramp

Column type | Active phase | I | Reference | Comment |
---|---|---|---|---|
Capillary | OV-351 | 1204. | Korhonen, 1984 | N2, 6. K/min; Column length: 25. m; Column diameter: 0.32 mm; Tstart: 50. C |

Normal alkane RI, non-polar column, custom temperature program

Column type | Active phase | I | Reference | Comment |
---|---|---|---|---|
Capillary | OV-1, SE-30, Methyl silicone, SP-2100, OV-101, DB-1, etc. | 861. | Waggott and Davies, 1984 | Hydrogen; Column length: 50. m; Column diameter: 0.32 mm; Program: not specified |

References

Aldrich Chemical Company Inc., 1990
Aldrich Chemical Company Inc.,
Catalog Handbook of Fine Chemicals, Aldrich Chemical Company, Inc., Milwaukee WI, 1990, 1. [all data]
Korhonen, 1984
Korhonen, I.O.O.,
Gas-Liquid Chromatographic Analyses. XXVI. Separation of Unsaturated Alcohols and Their Acetyl and Haloacetyl Derivatives on Capillary Columns Coated with SE-30 and OV-351,
J. Chromatogr., 1984, 288, 329-346, https://doi.org/10.1016/S0021-9673(01)93710-0
. [all data]
Tret'yakov, 2008
Tret'yakov, K.V.,
Retention Data. NIST Mass Spectrometry Data Center., NIST Mass Spectrometry Data Center, 2008. [all data]
Bauchot, Mottram, et al., 1998
Bauchot, A.D.; Mottram, D.S.; Dodson, A.T.; John, P.,
Effect of aminocyclopropane-1-carboxylic acid oxidase antisense gene on the formation of volatile esters in cantaloupe charentais melon (Cv. Védrandais),
J. Agric. Food Chem., 1998, 46, 11, 4787-4792, https://doi.org/10.1021/jf980692z
. [all data]
Waggott and Davies, 1984
Waggott, A.; Davies, I.W.,
Identification of organic pollutants using linear temperature programmed retention indices (LTPRIs) - Part II, 1984, retrieved from http://dwi.defra.gov.uk/research/completed-research/reports/dwi0383.pdf. [all data]