2(3H)-Naphthalenone, 4,4a,5,6,7,8-hexahydro-4,4a-dimethyl-6-(1-methylethylidene)-, (4R-cis)-
- Formula: C15H22O
- Molecular weight: 218.3346
- IUPAC Standard InChIKey: NIIPDXITZPFFTE-NHYWBVRUSA-N
- CAS Registry Number: 15764-04-2
- Chemical structure:
View 3d structure (requires JavaScript / HTML 5) - Other names: (4R,4aS)-4,4a-Dimethyl-6-(propan-2-ylidene)-4,4a,5,6,7,8-hexahydronaphthalen-2(3H)-one; (-)-β,γ-Nootkatone; α-Vetivone; Isonootkatone; (+)-α-Vetivone; 4βH,5α-Eremophila-1(10),7(11)-dien-2-one; (+)-Isonootkatone; Vetiverone; Isonootkaton; (+)-α-Vetivon; (4R-cis)-4,4a,5,6,7,8-hexahydro-4,4a-dimethyl-6-(1-methylethylidene)naphthalen-2(3H)-one

Kovats' RI, non-polar column, temperature ramp

Column type | Active phase | I | Reference | Comment |
---|---|---|---|---|
Capillary | DB-5 | 1809. | El-Ghorab, Fadel, et al., 2002 | 25. m/0.22 mm/0.25 μm, He, 3. K/min; Tstart: 60. C; Tend: 240. C |

Van Den Dool and Kratz RI, non-polar column, temperature ramp

Column type | Active phase | I | Reference | Comment |
---|---|---|---|---|
Capillary | DB-5 | 1842. | Adams, Habte, et al., 2004 | 30. m/0.26 mm/0.25 μm, He, 3. K/min; Tstart: 60. C; Tend: 246. C |
Capillary | CP Sil 5 CB | 1851. | Martinez, Rosa, et al., 2004 | 30. m/0.25 mm/0.25 μm, N2, 5. K/min; Tstart: 50. C; Tend: 200. C |

Normal alkane RI, non-polar column, temperature ramp

Column type | Active phase | I | Reference | Comment |
---|---|---|---|---|
Capillary | DB-5 | 1836. | Kobaisy, Tellez, et al., 2002 | 30. m/0.25 mm/0.25 μm, He, 3. K/min; Tstart: 60. C; Tend: 240. C |

Normal alkane RI, non-polar column, custom temperature program

Column type | Active phase | I | Reference | Comment |
---|---|---|---|---|
Capillary | DB-5 MS | 1825. | Lima, Quintans-Junior, et al., 2011 | Helium; Column length: 30. m; Column diameter: 0.25 mm; Program: 50 0C (1.5 min) 4 0C/min -> 200 0C 10 0C/min -> 300 0C (10 min) |
Capillary | DB-5 | 1845. | Massardo, Senatore, et al., 2006 | 30. m/0.25 mm/0.25 μm, He; Program: 40C (5min) => 2C/min => 250C(15min) => 5C/min => 270C (10min) |
Capillary | SE-30 | 1825. | Vinogradov, 2004 | Program: not specified |
Capillary | CP Sil 5 CB | 1813. | Weyerstahl, Marschall, et al., 2000 | N2; Column length: 25. m; Phase thickness: 0.39 μm; Program: not specified |
Capillary | CP Sil 5 CB | 1813. | Weyerstahl, Marschall, et al., 2000, 2 | Column length: 25. m; Program: not specified |
Capillary | Polydimethyl siloxanes | 1825. | Zenkevich, 1997 | Program: not specified |

References

El-Ghorab, Fadel, et al., 2002
El-Ghorab, A.H.; Fadel, H.M.; El-Massry, K.F.,
The Egyptian Eucalyptus camaldulensis var. brevirostris: chemical compositions of the fruit volatile oil and antioxidant activity,
Flavour Fragr. J., 2002, 17, 4, 306-312, https://doi.org/10.1002/ffj.1085
. [all data]
Adams, Habte, et al., 2004
Adams, R.P.; Habte, M.; Park, S.; Dafforn, M.R.,
Preliminary comparison of vetiver root essential oils from cleansed (bacteria- and fungus-free) versus non-cleansed (normal) vetiver plants,
Biochem. Syst. Ecol., 2004, 32, 12, 1137-1144, https://doi.org/10.1016/j.bse.2004.03.013
. [all data]
Martinez, Rosa, et al., 2004
Martinez, J.; Rosa, P.T.V.; Menut, C.; Leydet, A.; Brat, P.; Pallet, D.; Meireles, M.A.A.,
Valorization of Brazilian vetiver (Vetiveria zizanioides (L.) Nash ex Small) oil,
J. Agric. Food Chem., 2004, 52, 21, 6578-6584, https://doi.org/10.1021/jf049182x
. [all data]
Kobaisy, Tellez, et al., 2002
Kobaisy, M.; Tellez, M.R.; Dayan, F.E.; Duke, S.O.,
Phytotoxicity and volatile constituents from leaves of Callicarpa japonica Thunb.,
Phytochemistry, 2002, 61, 1, 37-40, https://doi.org/10.1016/S0031-9422(02)00207-8
. [all data]
Lima, Quintans-Junior, et al., 2011
Lima, G.M.; Quintans-Junior, L.J.; Thomazzi, S.M.; Almeida, E.M.S.A.; Melo, M.S.; Serafini, M.R.; Cavalcanti, S.C.H.; Gelain, D.P.; Santos, J.P.A.; Blank, A.F.; Alves, P.B.; Neta, P.M.O.; Lima, J.T.; Rocha, R.F.; Moreira, J.C.F.; Araujo, A.A.S.,
Phytochemical screening, antinociceptive and anti-inflammatory activities of Chrysopogon zizanioides essential oil,
Braz. J. Pharmacognosy, 2011, 1-8. [all data]
Massardo, Senatore, et al., 2006
Massardo, D.R.; Senatore, F.; Alifano, P.; del Giudice, L.; Pontieri, P.,
Vetiver oil production correlates with early root growth,
Biochem. Syst. Ecol., 2006, 34, 5, 376-382, https://doi.org/10.1016/j.bse.2005.10.016
. [all data]
Vinogradov, 2004
Vinogradov, B.A.,
Production, composition, properties and application of essential oils, 2004, retrieved from http://viness.narod.ru. [all data]
Weyerstahl, Marschall, et al., 2000
Weyerstahl, P.; Marschall, H.; Splittgerber, U. Wolf,
Analysis of the polar fraction of Haitian vetiver oil,
Flavour Fragr. J., 2000, 15, 3, 153-173, https://doi.org/10.1002/1099-1026(200005/06)15:3<153::AID-FFJ885>3.0.CO;2-5
. [all data]
Weyerstahl, Marschall, et al., 2000, 2
Weyerstahl, P.; Marschall, H.; Splittgerber, U.; Wolf, D.; Surburg, H.,
Constituents of Haitian vetiver oil,
Flavour Fragr. J., 2000, 15, 6, 395-412, https://doi.org/10.1002/1099-1026(200011/12)15:6<395::AID-FFJ930>3.0.CO;2-9
. [all data]
Zenkevich, 1997
Zenkevich, I.G.,
Analytical Parameters of Components of Essential Oils for their Chromatographic and Chromato-Spectral Identificaiton. Oxsigenated derivatives of Mono- and Sesquiterpene Hydrocarbons,
Rastit, Resursy (Rus.), 1997, 33, 1, 16-28. [all data]