Benzamide, N-acetyl-
- Formula: C9H9NO2
- Molecular weight: 163.1733
- IUPAC Standard InChIKey: KGGRQKDGRGUWAT-UHFFFAOYSA-N
- CAS Registry Number: 1575-95-7
- Chemical structure:
View 3d structure (requires JavaScript / HTML 5) - Other names: N-Acetylbenzamide

Condensed phase thermochemistry data

Data compiled by: Hussein Y. Afeefy, Joel F. Liebman, and Stephen E. Stein
Quantity | Value | Units | Method | Reference | Comment |
---|---|---|---|---|---|
ΔcH°solid | -4454.59 | kJ/mol | Ccb | Parts, 1928 |

References

Parts, 1928
Parts, A.,
Uber die Verbrennungswarme von einigen sekundaren und tertiaren Amiden,
Z. Phys. Chem., 1928, 131, 405-408. [all data]