cis,trans-Cyclonona-1,5-diene
- Formula: C9H14
- Molecular weight: 122.2075
- IUPAC Standard InChIKey: UWMOLRCQDVCRLG-UYIJSCIWSA-N
- CAS Registry Number: 15753-74-9
- Chemical structure:
View 3d structure (requires JavaScript / HTML 5) - Stereoisomers:

Reaction thermochemistry data

Data compiled by: Hussein Y. Afeefy, Joel F. Liebman, and Stephen E. Stein
Individual Reactions
By formula: 2H2 + C9H14 = C9H18
Quantity | Value | Units | Method | Reference | Comment |
---|---|---|---|---|---|
ΔrH° | -211.8 ± 1.3 | kJ/mol | Chyd | Turner, Mallon, et al., 1973 | liquid phase; solvent: Glacial acetic acid |

References

Turner, Mallon, et al., 1973
Turner, R.B.; Mallon, B.J.; Tichy, M.; Doering, W.v.E.; Roth, W.R.; Schroder, G.,
Heats of hydrogenation. X. Conjugative interaction in cyclic dienes and trienes,
J. Am. Chem. Soc., 1973, 95, 8605-8610. [all data]