4-trans-(4-fluorophenylethyl)cyclohexyl (E)-butenoate

Phase change data

Data compiled by: William E. Acree, Jr., James S. Chickos

Enthalpy of fusion

ΔfusH (kJ/mol) Temperature (K) Reference
25.0335.2Kelly, Schadt, et al., 1995

References

Kelly, Schadt, et al., 1995
Kelly, S.M.; Schadt, M.; Seiberle, H., Polar nematic trans -4-substituted-cyclohexyl ( E )-alk-2-enoates The influence of dipoles and double bonds on the transition temperatures and other physical properties, Liquid Crystals, 1995, 18, 4, 581-594, https://doi.org/10.1080/02678299508036661 . [all data]