Ethyl 2-cyanopropionate
- Formula: C6H9NO2
- Molecular weight: 127.1412
- IUPAC Standard InChIKey: MIHRVXYXORIINI-UHFFFAOYSA-N
- CAS Registry Number: 1572-99-2
- Chemical structure:
View 3d structure (requires JavaScript / HTML 5) - Other names: 2-Cyanopropionic acid ethyl ester; Propanoic acid, 2-cyano-, ethyl ester; Ethyl 2-cyanopropanoate

Gas phase thermochemistry data

Data compiled by: Hussein Y. Afeefy, Joel F. Liebman, and Stephen E. Stein
Quantity | Value | Units | Method | Reference | Comment |
---|---|---|---|---|---|
ΔfH°gas | -311.96 ± 0.63 | kJ/mol | Ccb | Verevkin, Beckhaus, et al., 1995 |

Condensed phase thermochemistry data

Data compiled by: Hussein Y. Afeefy, Joel F. Liebman, and Stephen E. Stein
Quantity | Value | Units | Method | Reference | Comment |
---|---|---|---|---|---|
ΔfH°liquid | -370.54 ± 0.54 | kJ/mol | Ccb | Verevkin, Beckhaus, et al., 1995 | |
Quantity | Value | Units | Method | Reference | Comment |
ΔcH°liquid | -3276.8 ± 0.29 | kJ/mol | Ccb | Verevkin, Beckhaus, et al., 1995 |

Phase change data

Data compiled as indicated in comments:
ALS - Hussein Y. Afeefy, Joel F. Liebman, and Stephen E. Stein
AC - William E. Acree, Jr., James S. Chickos
Quantity | Value | Units | Method | Reference | Comment |
---|---|---|---|---|---|
ΔvapH° | 58.58 ± 0.29 | kJ/mol | V | Verevkin, Beckhaus, et al., 1995 | ALS |
ΔvapH° | 58.6 ± 0.3 | kJ/mol | GS | Verevkin, Beckhaus, et al., 1995 | Based on data from 283. to 323. K.; AC |

References

Verevkin, Beckhaus, et al., 1995
Verevkin, S.P.; Beckhaus, H.-D.; Ruchardt, C.,
Geminale substituenteneffekte. Teil 6. Standardbildungsenthalpien von alkylsubstituierten-alkoxynitrilen und α-cyano-carbonsaureestern,
Thermochim. Acta, 1995, 249, 1-11. [all data]