2,2-Dimethylvaleroyl chloride
- Formula: C7H13ClO
- Molecular weight: 148.631
- IUPAC Standard InChIKey: NUBKYCCXDNYHLQ-UHFFFAOYSA-N
- CAS Registry Number: 15721-22-9
- Chemical structure:
View 3d structure (requires JavaScript / HTML 5) - Other names: Pentanoyl chloride, 2,2-dimethyl-

Phase change data

Data compiled by: Robert L. Brown and Stephen E. Stein
Reduced pressure boiling point
Tboil (K) | Pressure (bar) | Reference |
---|---|---|
333. to 334. | 0.040 | Frinton Laboratories Inc., 1986 |

References

Frinton Laboratories Inc., 1986
Frinton Laboratories Inc.,
Catalog Number 11, Frinton Laboratories Inc., Vineland, NJ, 1986, 99. [all data]