p-Menth-3-en-9-ol
- Formula: C10H18O
- Molecular weight: 154.2493
- IUPAC Standard InChIKey: KFUIAXXMGXAVHN-UHFFFAOYSA-N
- CAS Registry Number: 15714-10-0
- Chemical structure:
View 3d structure (requires JavaScript / HTML 5) - Other names: 2-(4-Methyl-1-cyclohexen-1-yl)-1-propanol; 1-Cyclohexene-1-ethanol, β,4-dimethyl-; p-Menth-4-en-9-ol

Kovats' RI, polar column, isothermal

Column type | Active phase | Temperature (C) | I | Reference | Comment |
---|---|---|---|---|---|
Capillary | PEG-20M | 120. | 1736. | Albalgés and Guardino, 1985 | |
Capillary | PEG-20M | 140. | 1745. | Albalgés and Guardino, 1985 | |
Capillary | PEG-20M | 160. | 1754. | Albalgés and Guardino, 1985 |

Normal alkane RI, non-polar column, custom temperature program

Column type | Active phase | I | Reference | Comment |
---|---|---|---|---|
Capillary | SE-30 | 1141. | Vinogradov, 2004 | Program: not specified |
Capillary | Polydimethyl siloxanes | 1141. | Zenkevich, 1997 | Program: not specified |

Normal alkane RI, polar column, custom temperature program

Column type | Active phase | I | Reference | Comment |
---|---|---|---|---|
Capillary | Carbowax 20M | 1736. | Vinogradov, 2004 | Program: not specified |

References

Albalgés and Guardino, 1985
Albalgés, J.; Guardino, X.,
High resolution gas chromatographic analysis of monocyclic terpene alcohols,
J. Hi. Res. Chromatogr. Chromatogr. Comm., 1985, 8, 6, 301-302, https://doi.org/10.1002/jhrc.1240080607
. [all data]
Vinogradov, 2004
Vinogradov, B.A.,
Production, composition, properties and application of essential oils, 2004, retrieved from http://viness.narod.ru. [all data]
Zenkevich, 1997
Zenkevich, I.G.,
Analytical Parameters of Components of Essential Oils for their Chromatographic and Chromato-Spectral Identificaiton. Oxsigenated derivatives of Mono- and Sesquiterpene Hydrocarbons,
Rastit, Resursy (Rus.), 1997, 33, 1, 16-28. [all data]