Benzoic acid, 4-formyl-, methyl ester
- Formula: C9H8O3
- Molecular weight: 164.1580
- IUPAC Standard InChIKey: FEIOASZZURHTHB-UHFFFAOYSA-N
- CAS Registry Number: 1571-08-0
- Chemical structure:
View 3d structure (requires JavaScript / HTML 5) - Other names: p-Carbomethoxybenzaldehyde; 4-Carbomethoxybenzaldehyde; 4-Carboxybenzaldehyde methyl ester; p-Formylbenzoic acid methyl ester; 4-(Methoxycarbonyl)benzaldehyde; Methyl benzaldehyde-4-carboxylate; Methyl p-formylbenzoate; Methyl 4-formylbenzoate; Methyl terephthalaldehydate; Terephthalaldehydic acid, methyl ester; p-Methoxycarbonylbenzaldehyde; Methyl terephthaldehydate; 4-HC(O)-C6H4-COOCH3; 4-Formylbenzoic acid methyl ester; NSC 28459

Gas phase ion energetics data

Data evaluated as indicated in comments:
HL - Edward P. Hunter and Sharon G. Lias
Data compiled as indicated in comments:
B - John E. Bartmess
Quantity | Value | Units | Method | Reference | Comment |
---|---|---|---|---|---|
Proton affinity (review) | 832.9 | kJ/mol | N/A | Hunter and Lias, 1998 | HL |
Quantity | Value | Units | Method | Reference | Comment |
Gas basicity | 801.9 | kJ/mol | N/A | Hunter and Lias, 1998 | HL |
Electron affinity determinations
EA (eV) | Method | Reference | Comment |
---|---|---|---|
1.158 ± 0.087 | IMRE | Mishima, Huh, et al., 1995 | ΔGea(343 K)=-25.5 kcal/mol Reanchored to EA(PhNO2), Kebarle and Chowdhury, 1987.; B |
1.049 ± 0.087 | IMRE | Huh, Kang, et al., 1999 | ΔG(EA) 343K; anchored to ΔG value. Including anchor ΔS, EA is ca. 0.4 kcal/mol more bound.; B |

Phase change data

Data compiled by: Robert L. Brown and Stephen E. Stein
Quantity | Value | Units | Method | Reference | Comment |
---|---|---|---|---|---|
Tboil | 538.2 | K | N/A | Aldrich Chemical Company Inc., 1990 |

References

Hunter and Lias, 1998
Hunter, E.P.; Lias, S.G.,
Evaluated Gas Phase Basicities and Proton Affinities of Molecules: An Update,
J. Phys. Chem. Ref. Data, 1998, 27, 3, 413-656, https://doi.org/10.1063/1.556018
. [all data]
Mishima, Huh, et al., 1995
Mishima, M.; Huh, C.; Lee, H.W.; Nakamura, H.; Fujio, M.; Tsuno, Y.,
Electron affinities of acetophenones and methyl benzoates. Varying resonance demand of aromatic radical anions,
Tetrahed. Lett., 1995, 36, 13, 2265, https://doi.org/10.1016/0040-4039(95)00267-G
. [all data]
Kebarle and Chowdhury, 1987
Kebarle, P.; Chowdhury, S.,
Electron affinities and electron transfer reactions,
Chem. Rev., 1987, 87, 513. [all data]
Huh, Kang, et al., 1999
Huh, C.; Kang, C.H.; Lee, H.W.; Nakamura, H.; Mishima, M.; Tsuno, Y.; Yamataka, H.,
Thermodynamic stabilities and resonance demand of aromatic radical anions in the gas phase,
Bull. Chem. Soc. Japan, 1999, 72, 5, 1083-1091, https://doi.org/10.1246/bcsj.72.1083
. [all data]