2,3-Diethylpyrazine
- Formula: C8H12N2
- Molecular weight: 136.1943
- IUPAC Standard InChIKey: GZXXANJCCWGCSV-UHFFFAOYSA-N
- CAS Registry Number: 15707-24-1
- Chemical structure:
View 3d structure (requires JavaScript / HTML 5) - Other names: Pyrazine, 2,3-diethyl-

Phase change data

Data compiled by: Robert L. Brown and Stephen E. Stein
Quantity | Value | Units | Method | Reference | Comment |
---|---|---|---|---|---|
Tboil | 454.2 | K | N/A | Aldrich Chemical Company Inc., 1990 |

Normal alkane RI, non-polar column, custom temperature program

Data compiled by: NIST Mass Spectrometry Data Center, William E. Wallace, director

Column type CapillaryCapillaryCapillary
Active phase SLB-5MSHP-5HP-5
Column length (m) 10.30.30.
Carrier gas HeliumHeHe
Substrate
Column diameter (mm) 0.180.250.25
Phase thickness (μm) 0.180.250.25
Program not specified50 C(1min) => 20C/min => 80C => 25C/min => 250C (3 min)50 C(1min) => 20C/min => 80C => 25C/min => 250C (3 min)
I 1080.1090.1092.
ReferenceRisticevic, Carasek, et al., 2008Hartmann, 2003Hartmann, 2003
Comment MSDC-RI MSDC-RI MSDC-RI

References

Aldrich Chemical Company Inc., 1990
Aldrich Chemical Company Inc.,
Catalog Handbook of Fine Chemicals, Aldrich Chemical Company, Inc., Milwaukee WI, 1990, 1. [all data]