(-)-D-arginine hydrate
- Formula: C6H14N4O2
- Molecular weight: 174.2010
- IUPAC Standard InChIKey: ODKSFYDXXFIFQN-BYPYZUCNSA-N
- CAS Registry Number: 157-06-2
- Chemical structure:
View 3d structure (requires JavaScript / HTML 5) - Stereoisomers:
- Other names: D-Arginine

Condensed phase thermochemistry data

Data compiled as indicated in comments:
ALS - Hussein Y. Afeefy, Joel F. Liebman, and Stephen E. Stein
DH - Eugene S. Domalski and Elizabeth D. Hearing
Quantity | Value | Units | Method | Reference | Comment |
---|---|---|---|---|---|
ΔfH°solid | -623.6 ± 1.3 | kJ/mol | Ccb | Huffman, Fox, et al., 1937 | Author's hf298=-150.16 kcal/mol; ALS |
Quantity | Value | Units | Method | Reference | Comment |
ΔcH°solid | -3738.3 ± 1.3 | kJ/mol | Ccb | Huffman, Fox, et al., 1937 | Author's hf298=-150.16 kcal/mol; ALS |
Quantity | Value | Units | Method | Reference | Comment |
S°solid,1 bar | 250.6 | J/mol*K | N/A | Huffman and Ellis, 1937 | Extrapolation below 90 K, 73.30 J/mol*K.; DH |
Constant pressure heat capacity of solid
Cp,solid (J/mol*K) | Temperature (K) | Reference | Comment |
---|---|---|---|
232.8 | 296.8 | Huffman and Ellis, 1937 | T = 86 to 297 K. Value is unsmoothed experimental datum.; DH |

References

Huffman, Fox, et al., 1937
Huffman, H.M.; Fox, S.W.; Ellis, E.L.,
Thermal data. VII. The heats of combustion of seven amino acids,
J. Am. Chem. Soc., 1937, 59, 2144-21. [all data]
Huffman and Ellis, 1937
Huffman, H.M.; Ellis, E.L.,
Thermal data. VIII. The heat capacities, entropies and free energies of some amino acids,
J. Am. Chem. Soc., 1937, 59, 2150-2152. [all data]