Cyclohexanethiol
- Formula: C6H12S
- Molecular weight: 116.224
- IUPAC Standard InChIKey: CMKBCTPCXZNQKX-UHFFFAOYSA-N
- CAS Registry Number: 1569-69-3
- Chemical structure:
View 3d structure (requires JavaScript / HTML 5) - Other names: Cyclohexyl mercaptan; Cyclohexyl thiol; Cyklohexylmerkaptan; Cyklohexanthiol

Gas phase thermochemistry data

Data compiled by: Hussein Y. Afeefy, Joel F. Liebman, and Stephen E. Stein
Quantity | Value | Units | Method | Reference | Comment |
---|---|---|---|---|---|
ΔfH°gas | -95.73 ± 0.79 | kJ/mol | Ccr | Good, 1972 | |
ΔfH°gas | -95.69 | kJ/mol | Ccb | Scott and Crowder, 1967 | Corrected for Sulfer |

Condensed phase thermochemistry data

Data compiled as indicated in comments:
ALS - Hussein Y. Afeefy, Joel F. Liebman, and Stephen E. Stein
DH - Eugene S. Domalski and Elizabeth D. Hearing
Quantity | Value | Units | Method | Reference | Comment |
---|---|---|---|---|---|
ΔfH°liquid | -140.4 ± 0.79 | kJ/mol | Ccr | Good, 1972 | ALS |
Quantity | Value | Units | Method | Reference | Comment |
ΔcH°liquid | -4537.6 ± 3.6 | kJ/mol | Ccr | Good, 1972 | Reanalyzed by Pedley, Naylor, et al., 1986, Original value = -4537.34 ± 0.67 kJ/mol; ALS |
Quantity | Value | Units | Method | Reference | Comment |
S°liquid | 255.57 | J/mol*K | N/A | Messerly and Todd, 1967 | DH |
Constant pressure heat capacity of liquid
Cp,liquid (J/mol*K) | Temperature (K) | Reference | Comment |
---|---|---|---|
192.63 | 298.15 | Messerly and Todd, 1967 | T = 10 to 370 K.; DH |

Phase change data

Data compiled as indicated in comments:
BS - Robert L. Brown and Stephen E. Stein
TRC - Thermodynamics Research Center, NIST Boulder Laboratories, Chris Muzny director
AC - William E. Acree, Jr., James S. Chickos
ALS - Hussein Y. Afeefy, Joel F. Liebman, and Stephen E. Stein
DRB - Donald R. Burgess, Jr.
DH - Eugene S. Domalski and Elizabeth D. Hearing
Quantity | Value | Units | Method | Reference | Comment |
---|---|---|---|---|---|
Tboil | 432.2 | K | N/A | Weast and Grasselli, 1989 | BS |
Tboil | 432. | K | N/A | Majer and Svoboda, 1985 | |
Tboil | 431.95 | K | N/A | Lanum and Morris, 1969 | Uncertainty assigned by TRC = 0.2 K; TRC |
Tboil | 427. | K | N/A | Jones and Reid, 1938 | Uncertainty assigned by TRC = 4. K; TRC |
Tboil | 428. | K | N/A | Sabatier and Mailhe, 1910 | Uncertainty assigned by TRC = 3. K; TRC |
Quantity | Value | Units | Method | Reference | Comment |
Ttriple | 189.6300 | K | N/A | Messerly, Todd, et al., 1967 | Uncertainty assigned by TRC = 0.005 K; extrapolation of T vs 1/F plot, meas. in adiab. calorimeter; TRC |
Quantity | Value | Units | Method | Reference | Comment |
Tc | 664. | K | N/A | Majer and Svoboda, 1985 | |
Quantity | Value | Units | Method | Reference | Comment |
ΔvapH° | 44.57 | kJ/mol | N/A | Majer and Svoboda, 1985 | |
ΔvapH° | 44.9 | kJ/mol | C | Hossenlopp and Scott, 1981 | AC |
ΔvapH° | 44.6 ± 0.2 | kJ/mol | V | Good, 1972 | ALS |
ΔvapH° | 44.7 | kJ/mol | N/A | Good, 1972 | DRB |
ΔvapH° | 44.6 ± 0.1 | kJ/mol | N/A | Good, 1972 | See also Osborn and Douslin, 1966.; AC |
Enthalpy of vaporization
ΔvapH (kJ/mol) | Temperature (K) | Method | Reference | Comment |
---|---|---|---|---|
37.06 | 432. | N/A | Majer and Svoboda, 1985 | |
41.2 | 370. | A,EB | Stephenson and Malanowski, 1987 | Based on data from 355. to 476. K. See also Osborn and Douslin, 1966 and Dykyj, Svoboda, et al., 1999.; AC |
Enthalpy of vaporization
ΔvapH =
A exp(-βTr) (1 − Tr)β
ΔvapH =
Enthalpy of vaporization (at saturation pressure)
(kJ/mol)
Tr = reduced temperature (T / Tc)
View plot Requires a JavaScript / HTML 5 canvas capable browser.
Temperature (K) | A (kJ/mol) | β | Tc (K) | Reference | Comment |
---|---|---|---|---|---|
384. to 421. | 59.79 | 0.2811 | 664. | Majer and Svoboda, 1985 |
Antoine Equation Parameters
log10(P) = A − (B / (T + C))
P = vapor pressure (bar)
T = temperature (K)
View plot Requires a JavaScript / HTML 5 canvas capable browser.
Temperature (K) | A | B | C | Reference |
---|---|---|---|---|
356.89 to 475.79 | 4.01199 | 1476.958 | -63.293 | Osborn and Douslin, 1966 |
Enthalpy of fusion
ΔfusH (kJ/mol) | Temperature (K) | Reference | Comment |
---|---|---|---|
10.000 | 189.64 | Messerly and Todd, 1967 | DH |
10.0 | 189.6 | Domalski and Hearing, 1996 | AC |
Entropy of fusion
ΔfusS (J/mol*K) | Temperature (K) | Reference | Comment |
---|---|---|---|
52.73 | 189.64 | Messerly and Todd, 1967 | DH |

Kovats' RI, non-polar column, isothermal

View large format table.

Column type Active phase Temperature (C) I Reference Comment
PackedApiezon M130.983.Garbuzov, Misharina, et al., 1985He or N2, Chromosorb W, AW-DMCS; Column length: 2.1 m

Kovats' RI, non-polar column, custom temperature program

View large format table.

Column type Active phase I Reference Comment
CapillaryApiezon M983.Zhu, Wang, et al., 2007Program: not specified

References

Good, 1972
Good, W.D.,
Enthalpies of combustion of 18 organic sulfur compounds related to petroleum,
J. Chem. Eng. Data, 1972, 17, 158-162. [all data]
Scott and Crowder, 1967
Scott, D.W.; Crowder, G.A.,
Cyclohexanethiol and 2,4-dimethyl-3-thiapentane: Molecular vibrations, conformational analyses, and chemical thermodynamic properties,
J. Chem. Phys., 1967, 46, 1054-1062. [all data]
Pedley, Naylor, et al., 1986
Pedley, J.B.; Naylor, R.D.; Kirby, S.P.,
Thermochemical Data of Organic Compounds, Chapman and Hall, New York, 1986, 1-792. [all data]
Messerly and Todd, 1967
Messerly, J.F.; Todd, S.S.,
and Guthrie, G.B.Jr, Low-temperature thermal properties of cyclohexanethiol and 2,4-dimethyl-3-thiapentane,
J. Chem. Eng. Data, 1967, 12, 426-429. [all data]
Weast and Grasselli, 1989
CRC Handbook of Data on Organic Compounds, 2nd Editon, Weast,R.C and Grasselli, J.G., ed(s)., CRC Press, Inc., Boca Raton, FL, 1989, 1. [all data]
Majer and Svoboda, 1985
Majer, V.; Svoboda, V.,
Enthalpies of Vaporization of Organic Compounds: A Critical Review and Data Compilation, Blackwell Scientific Publications, Oxford, 1985, 300. [all data]
Lanum and Morris, 1969
Lanum, W.J.; Morris, J.C.,
Physical Properties of Some Sulfur and Nitrogen Compounds,
J. Chem. Eng. Data, 1969, 14, 93-8. [all data]
Jones and Reid, 1938
Jones, S.O.; Reid, E.E.,
The Addition of Sulfurl, Hydrogen Sulfide and Mercaptans to Unsaturated Hydrocarbons,
J. Am. Chem. Soc., 1938, 60, 2452. [all data]
Sabatier and Mailhe, 1910
Sabatier, P.; Mailhe, A.,
General Methods for Direct Preparation of Thiols by Catalysic Splitting of Alcohols,
C. R. Hebd. Seances Acad. Sci., 1910, 150, 1217. [all data]
Messerly, Todd, et al., 1967
Messerly, J.F.; Todd, S.S.; Guthrie, G.B.,
Low Temperature Thermal Properties of Cyclohexanethiol and 2,4-Dimethyl-3-thiapentane,
J. Chem. Eng. Data, 1967, 12, 426-9. [all data]
Hossenlopp and Scott, 1981
Hossenlopp, I.A.; Scott, D.W.,
Vapor heat capacities and enthalpies of vaporizaiton of six organic compounds,
J. Chem. Thermodyn., 1981, 13, 405-414. [all data]
Osborn and Douslin, 1966
Osborn, A.G.; Douslin, D.R.,
Vapor Pressure Relations of 36 Sulfur Compounds Present in Petroleum.,
J. Chem. Eng. Data, 1966, 11, 4, 502-509, https://doi.org/10.1021/je60031a014
. [all data]
Stephenson and Malanowski, 1987
Stephenson, Richard M.; Malanowski, Stanislaw,
Handbook of the Thermodynamics of Organic Compounds, 1987, https://doi.org/10.1007/978-94-009-3173-2
. [all data]
Dykyj, Svoboda, et al., 1999
Dykyj, J.; Svoboda, J.; Wilhoit, R.C.; Frenkel, M.L.; Hall, K.R.,
Vapor Pressure of Chemicals: Part A. Vapor Pressure and Antoine Constants for Hydrocarbons and Sulfur, Selenium, Tellurium and Hydrogen Containing Organic Compounds, Springer, Berlin, 1999, 373. [all data]
Domalski and Hearing, 1996
Domalski, Eugene S.; Hearing, Elizabeth D.,
Heat Capacities and Entropies of Organic Compounds in the Condensed Phase. Volume III,
J. Phys. Chem. Ref. Data, 1996, 25, 1, 1, https://doi.org/10.1063/1.555985
. [all data]