Osmium, dodecacarbonyltri-, triangulo
- Formula: C12O12Os3
- Molecular weight: 906.81
- IUPAC Standard InChIKey: VUBLMKVEIPBYME-UHFFFAOYSA-N
- CAS Registry Number: 15696-40-9
- Chemical structure:

Gas phase thermochemistry data

Data compiled by: José A. Martinho Simões
Quantity | Value | Units | Method | Reference | Comment |
---|---|---|---|---|---|
ΔfH°gas | -1644. ± 26. | kJ/mol | Review | Martinho Simões |

Phase change data

Data compiled as indicated in comments:
AC - William E. Acree, Jr., James S. Chickos
MS - José A. Martinho Simões
Quantity | Value | Units | Method | Reference | Comment |
---|---|---|---|---|---|
ΔsubH° | 105. ± 20. | kJ/mol | N/A | Pilcher and Skinner, 1983 | See also Connor, Skinner, et al., 1973.; AC |
ΔsubH° | 105. ± 20. | kJ/mol | TD-HFC | Connor, Skinner, et al., 1973 | MS |
Enthalpy of vaporization
ΔvapH (kJ/mol) | Temperature (K) | Reference | Comment |
---|---|---|---|
101.7 | 520. | Gaidym, Baev, et al., 1974 | Based on data from 497. to 543. K.; AC |
Enthalpy of sublimation
ΔsubH (kJ/mol) | Temperature (K) | Reference | Comment |
---|---|---|---|
134.4 ± 0.4 | 349. to 396. | Chandra, Garner, et al., 1999 | AC |
108.4 | 483. | Gaidym, Baev, et al., 1974, 2 | Based on data from 423. to 543. K.; AC |

Reaction thermochemistry data

Data compiled by: José A. Martinho Simões
Individual Reactions
C11H2O11Os (solution) + (solution) =
(g) +
(solution)
By formula: C11H2O11Os (solution) + CO (solution) = H2 (g) + C12O12Os3 (solution)
Quantity | Value | Units | Method | Reference | Comment |
---|---|---|---|---|---|
ΔrH° | -37.7 ± 9.6 | kJ/mol | ES/KS | Poë, Sampson, et al., 1993 | solvent: Decalin; Calculated from equilibrium and kinetic data Poë, Sampson, et al., 1993. |
ΔrH° | -77.4 ± 9.7 | kJ/mol | N/A | Poë, Sampson, et al., 1993 | solvent: Decalin; Calculated from data for the reactions Os3(CO)10(H)2(solution) + CO(solution) = Os3(CO)11(H)2(solution) (hrxn [kJ/mol]=-39.7±1.3, srxn [J/(mol K)]=-80.3±3.8) and Os3(CO)11(H)2(solution) + CO(solution) = Os3(CO)12(solution) + H2(g) (hrxn [kJ/mol]=-37.7±9.6, srxn [J/(mol K)]=-32.6±27.6) Poë, Sampson, et al., 1993. |
By formula: C12O12Os3 (cr) = 12CO (g) + 3Os (cr)
Quantity | Value | Units | Method | Reference | Comment |
---|---|---|---|---|---|
ΔrH° | 423. ± 17. | kJ/mol | TD-HFC | Connor, Skinner, et al., 1973 | Please also see Pedley and Rylance, 1977. The value for the reaction enthalpy was considered a low limit Connor, Skinner, et al., 1973 |

Condensed phase thermochemistry data

Data compiled by: José A. Martinho Simões
Quantity | Value | Units | Method | Reference | Comment |
---|---|---|---|---|---|
ΔfH°solid | -1749. ± 17. | kJ/mol | Review | Martinho Simões |

Gas phase ion energetics data

Data compiled as indicated in comments:
LBLHLM - Sharon G. Lias, John E. Bartmess, Joel F. Liebman, John L. Holmes, Rhoda D. Levin, and W. Gary Mallard
LLK - Sharon G. Lias, Rhoda D. Levin, and Sherif A. Kafafi
Ionization energy determinations
IE (eV) | Method | Reference | Comment |
---|---|---|---|
7.8 | PE | Sherwood and Hall, 1982 | LBLHLM |
7.83 | PE | Green, Mingos, et al., 1981 | Vertical value; LLK |
7.83 | PE | Mingos, 1980 | Vertical value; LLK |
7.83 | PE | Green, Mingos, et al., 1980 | Vertical value; LLK |
7.8 ± 0.2 | PE | Green, Seddon, et al., 1979 | Vertical value; LLK |

References

Martinho Simões
Martinho Simões, J.A.,
Private communication (see http://webbook.nist.gov/chemistry/om/). [all data]
Pilcher and Skinner, 1983
Pilcher, G.; Skinner, H.A.,
Thermochemistry of organometallic compounds, 1983, 43-90, https://doi.org/10.1002/9780470771686.ch2
. [all data]
Connor, Skinner, et al., 1973
Connor, J.A.; Skinner, H.A.; Virmani, Y.,
High temperature microcalorimetric studies of the thermal decomposition and iodination of polynuclear carbonyls of Fe, Co, Ru, Rh, Re, Os and Ir,
Faraday Symp. Chem. Soc., 1973, 8, 18, https://doi.org/10.1039/fs9730800018
. [all data]
Gaidym, Baev, et al., 1974
Gaidym, I.L.; Baev, A.K.; Syrkin, V.G.; Uel'skii, A.A.; Medvedeva, A.E.,
Russ. J. Phys. Chem., 1974, 48, 1111. [all data]
Chandra, Garner, et al., 1999
Chandra, D.; Garner, M.L.; Lau, K.H.,
Vapor pressures of osmium, rhodium, and ruthenium carbonyls,
JPE, 1999, 20, 6, 565-572, https://doi.org/10.1361/105497199770340554
. [all data]
Gaidym, Baev, et al., 1974, 2
Gaidym, I.L.; Baev, A.K.; Syrkin, V.G.; Uel'skii, A.A.; Medvedeva, A.V.,
Zh. Fiz. Khim., 1974, 48, 1871. [all data]
Poë, Sampson, et al., 1993
Poë, A.J.; Sampson, C.N.; Smith, R.T.; Zheng, Y.,
J. Am. Chem. Soc., 1993, 115, 3174. [all data]
Pedley and Rylance, 1977
Pedley, J.B.; Rylance, J.,
Computer Analysed Thermochemical Data: Organic and Organometallic Compounds, University of Sussex, Brigton, 1977. [all data]