cyclobutane, 1,2-dimethyl-, trans-
- Formula: C6H12
- Molecular weight: 84.1595
- IUPAC Standard InChIKey: IVAGOJQDJFWIRT-WDSKDSINSA-N
- CAS Registry Number: 15679-02-4
- Chemical structure:
View 3d structure (requires JavaScript / HTML 5) - Stereoisomers:

Phase change data

Data compiled by: Thermodynamics Research Center, NIST Boulder Laboratories, Chris Muzny director
Quantity | Value | Units | Method | Reference | Comment |
---|---|---|---|---|---|
Tboil | 330.0 | K | N/A | Kazanskii and Lukina, 1954 | Uncertainty assigned by TRC = 0.5 K |
Quantity | Value | Units | Method | Reference | Comment |
Tfus | 150.7 | K | N/A | Kazanskii and Lukina, 1954 | Uncertainty assigned by TRC = 2. K |

Reaction thermochemistry data

Data compiled by: Hussein Y. Afeefy, Joel F. Liebman, and Stephen E. Stein
Individual Reactions
By formula: 2H2 + C6H8 = C6H12
Quantity | Value | Units | Method | Reference | Comment |
---|---|---|---|---|---|
ΔrH° | -244. ± 0.8 | kJ/mol | Chyd | Roth, Lennartz, et al., 1986 | liquid phase; solvent: Isooctane; Mixture cis and trans |
By formula: 3H2 + C6H6 = C6H12
Quantity | Value | Units | Method | Reference | Comment |
---|---|---|---|---|---|
ΔrH° | -376. ± 1. | kJ/mol | Chyd | Roth, Lennartz, et al., 1986 | liquid phase; solvent: Isooctane; Mixture cis and trans |
By formula: C4H8 + C2H4 = C6H12
Quantity | Value | Units | Method | Reference | Comment |
---|---|---|---|---|---|
ΔrH° | -69.9 | kJ/mol | Eqk | Scacchi and Back, 1977 | liquid phase |

References

Kazanskii and Lukina, 1954
Kazanskii, B.A.; Lukina, M.Y.,
Synthesis of 1,2-Dimethylcyclobutane,
Doklady Akad. Nauk. S.S.S.R., 1954, 94, 887-9. [all data]
Roth, Lennartz, et al., 1986
Roth, W.E.; Lennartz, H.W.; Vogel, E.; Leiendecker, M.; Masaji, O.,
Heats of hydrogenation. 6. Resonance energy of fused [4n]annulenes,
Chem. Ber., 1986, 119, 837-843. [all data]
Scacchi and Back, 1977
Scacchi, G.; Back, M.H.,
The cycloaddition of ethylene to butene-2. II. Energy relations,
Int. J. Chem. Kinet., 1977, 9, 525-534. [all data]