3-methyl-3-penten-2-one(Z)
- Formula: C6H10O
- Molecular weight: 98.1430
- IUPAC Standard InChIKey: ZAMCMCQRTZKGDX-PLNGDYQASA-N
- CAS Registry Number: 1567-72-2
- Chemical structure:
View 3d structure (requires JavaScript / HTML 5) - Stereoisomers:

Gas phase ion energetics data

Data evaluated by: Edward P. Hunter and Sharon G. Lias
Quantity | Value | Units | Method | Reference | Comment |
---|---|---|---|---|---|
Proton affinity (review) | 866.4 | kJ/mol | N/A | Hunter and Lias, 1998 | |
Quantity | Value | Units | Method | Reference | Comment |
Gas basicity | 834.5 | kJ/mol | N/A | Hunter and Lias, 1998 |

References

Hunter and Lias, 1998
Hunter, E.P.; Lias, S.G.,
Evaluated Gas Phase Basicities and Proton Affinities of Molecules: An Update,
J. Phys. Chem. Ref. Data, 1998, 27, 3, 413-656, https://doi.org/10.1063/1.556018
. [all data]