1-Butanol, 2-methyl-, (S)-
- Formula: C5H12O
- Molecular weight: 88.1482
- IUPAC Standard InChIKey: QPRQEDXDYOZYLA-RXMQYKEDSA-N
- CAS Registry Number: 1565-80-6
- Chemical structure:
View 3d structure (requires JavaScript / HTML 5) - Stereoisomers:
- Other names: l-2-Methyl-1-butanol; (S)-(-)-2-Methyl-1-butanol; (S)-2-methylbutan-1-ol

Phase change data

Data compiled as indicated in comments:
BS - Robert L. Brown and Stephen E. Stein
TRC - Thermodynamics Research Center, NIST Boulder Laboratories, Chris Muzny director
Quantity | Value | Units | Method | Reference | Comment |
---|---|---|---|---|---|
Tboil | 401. ± 1. | K | AVG | N/A | Average of 6 values; Individual data points |

References

No reference data available.