Acetamide, N-acetyl-N-butyl-
- Formula: C8H15NO2
- Molecular weight: 157.2102
- IUPAC Standard InChIKey: FEOFWXBYTMJIBA-UHFFFAOYSA-N
- CAS Registry Number: 1563-86-6
- Chemical structure:
View 3d structure (requires JavaScript / HTML 5) - Other names: Diacetamide, N-butyl-; N,N-Diacetylbutylamine; N-Acetyl-n-butylacetamide

Phase change data

Data compiled as indicated in comments:
AC - William E. Acree, Jr., James S. Chickos
ALS - Hussein Y. Afeefy, Joel F. Liebman, and Stephen E. Stein
Quantity | Value | Units | Method | Reference | Comment |
---|---|---|---|---|---|
ΔvapH° | 64.4 ± 0.4 | kJ/mol | C | Wadsö, Borgen, et al., 1965 | AC |
ΔvapH° | 64.4 ± 0.4 | kJ/mol | C | Wadso, 1965 | ALS |

Reaction thermochemistry data

Data compiled by: Hussein Y. Afeefy, Joel F. Liebman, and Stephen E. Stein
Individual Reactions
By formula: C6H13NO + C2H4O2 = C8H15NO2 + H2O
Quantity | Value | Units | Method | Reference | Comment |
---|---|---|---|---|---|
ΔrH° | 40.5 ± 0.50 | kJ/mol | Cm | Wadso, 1965 | liquid phase; Heat of hydrolysis |

References

Wadsö, Borgen, et al., 1965
Wadsö, Ingemar; Borgen, Gerd L.; Sørensen, Georg Ole; Olsen, Gert; Jansen, Gert,
Thermochemical Properties of Diacetamide, N-Butyldiacetamide and N-Phenyldiacetamide.,
Acta Chem. Scand., 1965, 19, 1079-1087, https://doi.org/10.3891/acta.chem.scand.19-1079
. [all data]
Wadso, 1965
Wadso, I.,
Thermochemical properties of diacetimide, N-butyldiacetimide and N-phenyldiacetimide,
Acta Chem. Scand., 1965, 19, 1079-1087. [all data]