1-[1,2,4]Triazol-1-ylethanone
- Formula: C4H5N3O
- Molecular weight: 111.1020
- IUPAC Standard InChIKey: GLGDTYAVPSJOSQ-UHFFFAOYSA-N
- CAS Registry Number: 15625-88-4
- Chemical structure:
View 3d structure (requires JavaScript / HTML 5) - Other names: 1-Acetyl-1H-1,2,4-triazole; 1-Acetyl-1,2,4-triazole

Reaction thermochemistry data

Data compiled by: Hussein Y. Afeefy, Joel F. Liebman, and Stephen E. Stein
Individual Reactions
By formula: C4H5N3O + H2O = C2H3N3 + C2H4O2
Quantity | Value | Units | Method | Reference | Comment |
---|---|---|---|---|---|
ΔrH° | -30.5 ± 0.3 | kJ/mol | Cm | Wadso, 1960 | solid phase; Heat of hydrolysis |
By formula: C4H11N + C4H5N3O = C6H13NO + C2H3N3
Quantity | Value | Units | Method | Reference | Comment |
---|---|---|---|---|---|
ΔrH° | -85.8 ± 0.3 | kJ/mol | Cm | Wadso, 1962 | solid phase |
By formula: C4H5N3O + C6H7N = C8H9NO + C2H3N3
Quantity | Value | Units | Method | Reference | Comment |
---|---|---|---|---|---|
ΔrH° | -72.3 ± 0.3 | kJ/mol | Cm | Wadso, 1962 | solid phase |

References

Wadso, 1960
Wadso, I.,
Heats of hydrolysis of N-acetylated imidazole, 1,2,4-triazole and tetrazole,
Acta Chem. Scand., 1960, 14, 903-908. [all data]
Wadso, 1962
Wadso, I.,
Heats of aminolysis and hydrolysis of some N-acetyl compounds and of acetic anhydride,
Acta Chem. Scand., 1962, 16, 471-478. [all data]