3-dodecyloxypropane-1,2-diol
- Formula: C15H32O3
- Molecular weight: 260.4128
- IUPAC Standard InChIKey: GBXRUYNQDDTQQS-UHFFFAOYSA-N
- CAS Registry Number: 1561-07-5
- Chemical structure:
View 3d structure (requires JavaScript / HTML 5) - Other names: 3-(Dodecyloxy)-1,2-propanediol

Phase change data

Data compiled as indicated in comments:
TRC - Thermodynamics Research Center, NIST Boulder Laboratories, Chris Muzny director
AC - William E. Acree, Jr., James S. Chickos
Quantity | Value | Units | Method | Reference | Comment |
---|---|---|---|---|---|
Tfus | 323. | K | N/A | van Doren and van der Geest, 1990 | Uncertainty assigned by TRC = 1. K; TRC |
Enthalpy of fusion
ΔfusH (kJ/mol) | Temperature (K) | Method | Reference | Comment |
---|---|---|---|---|
51.4 | 323. | DSC | Acree, 1993 | AC |

References

van Doren and van der Geest, 1990
van Doren, H.A.; van der Geest, R.,
A comparative study of the liquid-crystalline behavior of three homologous series of 1,2-propanediol derivatives,
Recl.: J. R. Neth. Chem. Soc., 1990, 109, 197. [all data]
Acree, 1993
Acree, William E.,
Thermodynamic properties of organic compounds,
Thermochimica Acta, 1993, 219, 97-104, https://doi.org/10.1016/0040-6031(93)80486-T
. [all data]