Nonadecane, 2-methyl-
- Formula: C20H42
- Molecular weight: 282.5475
- IUPAC Standard InChIKey: LEEDMQGKBNGPDN-UHFFFAOYSA-N
- CAS Registry Number: 1560-86-7
- Chemical structure:
View 3d structure (requires JavaScript / HTML 5) - Other names: 2-Methylnonadecane

Phase change data

Data compiled as indicated in comments:
TRC - Thermodynamics Research Center, NIST Boulder Laboratories, Chris Muzny director
AC - William E. Acree, Jr., James S. Chickos
Quantity | Value | Units | Method | Reference | Comment |
---|---|---|---|---|---|
Tfus | 291.5 | K | N/A | Terres, Gebert, et al., 1954 | Uncertainty assigned by TRC = 0.5 K; TRC |
Tfus | 291.5 | K | N/A | Eykman, 1919 | Uncertainty assigned by TRC = 0.8 K; TRC |
Enthalpy of vaporization
ΔvapH (kJ/mol) | Temperature (K) | Method | Reference | Comment |
---|---|---|---|---|
72.4 | 480. | A | Stephenson and Malanowski, 1987 | Based on data from 465. to 607. K. See also Paridon, MacWood, et al., 1959.; AC |

Van Den Dool and Kratz RI, non-polar column, temperature ramp

Column type | Active phase | I | Reference | Comment |
---|---|---|---|---|
Capillary | Cross-Linked Methylsilicone | 1964. | Khorasheh, Gray, et al., 1989 | 5. K/min; Tstart: 40. C; Tend: 300. C |

Van Den Dool and Kratz RI, non-polar column, custom temperature program

Column type | Active phase | I | Reference | Comment |
---|---|---|---|---|
Capillary | DB-5 | 1966. | Zaikin and Borisov, 2002 | He; Column length: 30. m; Column diameter: 0.25 mm; Program: 30C => 5K/min=120C => 10C/min => 270C |

Normal alkane RI, non-polar column, temperature ramp

Column type | Active phase | I | Reference | Comment |
---|---|---|---|---|
Capillary | OV-1 | 1965.2 | Krkosova, Kubinec, et al., 2007 | 100. m/0.32 mm/0.25 μm, Helium, 5. K/min, 310. C @ 5. min; Tstart: 30. C |
Capillary | DB-1 | 1966. | Katritzky, Chen, et al., 2000 | 30. m/0.32 mm/0.25 μm; Tstart: 60. C; Tend: 320. C |

Normal alkane RI, non-polar column, custom temperature program

Column type | Active phase | I | Reference | Comment |
---|---|---|---|---|
Capillary | Siloxane, 5 % Ph | 1962. | VOC BinBase, 2012 | Program: not specified |
Capillary | Polydimethyl siloxane, 5 % phenyl | 1962. | Skogerson, Wohlgemuth, et al., 2011 | Program: not specified |
Capillary | Polydimethyl siloxane | 1966. | Junkes, Castanho, et al., 2003 | Program: not specified |
Capillary | Squalane | 1963. | Petrov, 1984 | Program: not specified |

References

Terres, Gebert, et al., 1954
Terres, E.; Gebert, F.; Fischer, D.; Modak, G.,
Brennst.-Chem., 1954, 35, 263-9. [all data]
Eykman, 1919
Eykman, J.F.,
Natuurkd. Verh. Hollandsche Maatschappij Wet. Haarlem, 1919, 8, 438. [all data]
Stephenson and Malanowski, 1987
Stephenson, Richard M.; Malanowski, Stanislaw,
Handbook of the Thermodynamics of Organic Compounds, 1987, https://doi.org/10.1007/978-94-009-3173-2
. [all data]
Paridon, MacWood, et al., 1959
Paridon, Leo J.; MacWood, George E.; Hu, Jih-Heng,
The Heat of Vaporization of Diborane,
J. Phys. Chem., 1959, 63, 12, 1998-1999, https://doi.org/10.1021/j150582a004
. [all data]
Khorasheh, Gray, et al., 1989
Khorasheh, F.; Gray, M.R.; Selucky, M.L.,
Correlation for Kováts retention index of C9-C26 monoalkyl and polymethyl alkanes and alkenes,
J. Chromatogr., 1989, 481, 1-16, https://doi.org/10.1016/S0021-9673(01)96747-0
. [all data]
Zaikin and Borisov, 2002
Zaikin, V.G.; Borisov, R.S.,
Chromatographic-mass spectrometric analysis of Fishcer-Tropsch synthesis products,
J. Anal. Chem. USSR (Engl. Transl.), 2002, 57, 6, 544-551. [all data]
Krkosova, Kubinec, et al., 2007
Krkosova, Z.; Kubinec, R.; Addova, G.; Jurdakova, H.; Blasko, J.; Ostrovsky, I.; Sojak, L.,
Gas chromatographic - mass spectrometric characterization of monomethylalkanes from fuel diesel,
Petroleum Coal, 2007, 49, 3, 51-62. [all data]
Katritzky, Chen, et al., 2000
Katritzky, A.R.; Chen, K.; Maran, U.; Carlson, D.A.,
QSPR Correlation and predictions of GC retention indexes for methyl-branched hydrocarbons produced by insects,
Anal. Chem., 2000, 72, 1, 101-109, https://doi.org/10.1021/ac990800w
. [all data]
VOC BinBase, 2012
VOC BinBase,
The volatile compound BinBase (VOC BinBase), 2012, retrieved from http://fiehnlab.ucdavis.edu/projects/VocBinBase and http://binbase.sourceforge.net. [all data]
Skogerson, Wohlgemuth, et al., 2011
Skogerson, K.; Wohlgemuth, G.; Fiehn, O.,
VocBinNase, 2011, retrieved from http://fiehnlab.ucdavis.edu/projects//VocBinBase. [all data]
Junkes, Castanho, et al., 2003
Junkes, B.S.; Castanho, R.D.M.; Amboni, C.; Yunes, R.A.; Heinzen, V.E.F.,
Semiempirical Topological Index: A Novel Molecular Descriptor for Quantitative Structure-Retention Relationship Studies,
Internet Electronic Journal of Molecular Design, 2003, 2, 1, 33-49. [all data]
Petrov, 1984
Petrov, A.A.,
Hydrocarbons of petroleum, Nauka (publishing house), Moscow, 1984, 263. [all data]