Benzene, 1-butenyl-, (Z)-
- Formula: C10H12
- Molecular weight: 132.2023
- IUPAC Standard InChIKey: MPMBRWOOISTHJV-CLTKARDFSA-N
- CAS Registry Number: 1560-09-4
- Chemical structure:
View 3d structure (requires JavaScript / HTML 5) - Stereoisomers:
- Other names: 1-phenyl-(Z)-1-butene; (Z)-1-Phenyl-1-butene

Phase change data

Data compiled by: Thermodynamics Research Center, NIST Boulder Laboratories, Chris Muzny director
Quantity | Value | Units | Method | Reference | Comment |
---|---|---|---|---|---|
Tboil | 461.65 | K | N/A | Amagat, 1931 | Uncertainty assigned by TRC = 4. K |
Tboil | 465. | K | N/A | Levy and Dvoleitzska-Gombinska, 1931 | Uncertainty assigned by TRC = 5. K |
Tboil | 453.15 | K | N/A | Boeseken and Blumberger, 1925 | Uncertainty assigned by TRC = 4. K |
Tboil | 462.15 | K | N/A | Klages, 1904 | Uncertainty assigned by TRC = 3. K |
Tboil | 462.15 | K | N/A | Kunckell and Siecke, 1903 | Uncertainty assigned by TRC = 3. K |

Normal alkane RI, non-polar column, temperature ramp

Column type | Active phase | I | Reference | Comment |
---|---|---|---|---|
Capillary | OV-101 | 1111. | Zenkevich, 2001 | N2, 4. K/min; Column length: 25. m; Column diameter: 0.20 mm; Tstart: 60. C; Tend: 240. C |

Normal alkane RI, polar column, temperature ramp

Column type | Active phase | I | Reference | Comment |
---|---|---|---|---|
Capillary | DB-Wax | 1391. | Horiuchi, Umano, et al., 1998 | 60. m/0.25 mm/1. μm, He, 3. K/min, 200. C @ 40. min; Tstart: 50. C |

Gas phase ion energetics data

Data compiled as indicated in comments:
LLK - Sharon G. Lias, Rhoda D. Levin, and Sherif A. Kafafi
Ionization energy determinations
IE (eV) | Method | Reference | Comment |
---|---|---|---|
8.15 | PE | Kobayashi, Arai, et al., 1981 | LLK |
8.54 | PE | Kobayashi, Arai, et al., 1981 | Vertical value; LLK |

References

Amagat, 1931
Amagat, P.,
Bull. Soc. Chim. Fr., 1931, 49, 1410. [all data]
Levy and Dvoleitzska-Gombinska, 1931
Levy, J.; Dvoleitzska-Gombinska,
Affinity Capacities and Migration Tendencies XI. Comparison of the Affinity Capacities of Aryl and Alkyl Radicals,
Bull. Soc. Chim. Fr., 1931, 49, 1765-6. [all data]
Boeseken and Blumberger, 1925
Boeseken, J.; Blumberger, J.S.P.,
Observation on the Speed of Oxidation of Several Aromatic Derivatives of Ethylene by the Prileshajew Reaction,
Recl. Trav. Chim. Pays-Bas, 1925, 44, 90. [all data]
Klages, 1904
Klages, A.,
Ber. Dtsch. Chem. Ges., 1904, 37, 2301. [all data]
Kunckell and Siecke, 1903
Kunckell, F.; Siecke, K.,
Chem. Ber., 1903, 36, 774. [all data]
Zenkevich, 2001
Zenkevich, I.G.,
Interpretation of Gas Chromatographic Retention Indices in estimation of Structures of Isomeric Products of Radical Chlorinating of Alkyl Arenes,
Zh. Org. Khim., 2001, 37, 2, 283-293. [all data]
Horiuchi, Umano, et al., 1998
Horiuchi, M.; Umano, K.; Shibamoto, T.,
Analysis of volatile compounds formed from fish oil heated with cysteine and trimethylamine oxide,
J. Agric. Food Chem., 1998, 46, 12, 5232-5237, https://doi.org/10.1021/jf980482m
. [all data]