Fluorene, 1,2,3,4,4a,9a-hexahydro-, cis-
- Formula: C13H16
- Molecular weight: 172.2661
- IUPAC Standard InChIKey: OSJFWOVKJZKBOA-WCQYABFASA-N
- CAS Registry Number: 1559-97-3
- Chemical structure:
View 3d structure (requires JavaScript / HTML 5) - Permanent link for this species. Use this link for bookmarking this species for future reference.

Reaction thermochemistry data

Data compiled by: Hussein Y. Afeefy, Joel F. Liebman, and Stephen E. Stein
Individual Reactions
By formula: 3H2 + C13H10 = C13H16
Quantity | Value | Units | Method | Reference | Comment |
---|---|---|---|---|---|
ΔrH° | -180. | kJ/mol | Eqk | Frye and Weitkamp, 1969 | gas phase |

References

Frye and Weitkamp, 1969
Frye, C.G.; Weitkamp, A.W.,
Equilibrium hydrogenations of multi-ring aromatics,
J. Chem. Eng. Data, 1969, 14, 372-376. [all data]