HMo
- Formula: HMo
- Molecular weight: 96.97
- CAS Registry Number: 15587-51-6

Reaction thermochemistry data

Data compiled by: John E. Bartmess
Individual Reactions
Mo- + = HMo
Quantity | Value | Units | Method | Reference | Comment |
---|---|---|---|---|---|
ΔrH° | 345.8 ± 4.5 | kcal/mol | D-EA | Bilodeau, Scheer, et al., 1998 | gas phase |
Quantity | Value | Units | Method | Reference | Comment |
ΔrG° | 335.0 ± 3.0 | kcal/mol | IMRB | Sallans, Lane, et al., 1985 | gas phase |

Gas phase ion energetics data

Data compiled by: John E. Bartmess
De-protonation reactions
Mo- + = HMo
Quantity | Value | Units | Method | Reference | Comment |
---|---|---|---|---|---|
ΔrH° | 345.8 ± 4.5 | kcal/mol | D-EA | Bilodeau, Scheer, et al., 1998 | gas phase |
Quantity | Value | Units | Method | Reference | Comment |
ΔrG° | 335.0 ± 3.0 | kcal/mol | IMRB | Sallans, Lane, et al., 1985 | gas phase |

References

Bilodeau, Scheer, et al., 1998
Bilodeau, R.C.; Scheer, M.; Haugen, H.K.,
Infrared Laser Photodetachment of Transition Metal Negative Ions: Studies on Cr-, Mo-, Cu-, and Ag-,
J. Phys. B: Atom. Mol. Opt. Phys., 1998, 31, 17, 3885-3891, https://doi.org/10.1088/0953-4075/31/17/013
. [all data]
Sallans, Lane, et al., 1985
Sallans, L.; Lane, K.R.; Squires, R.R.; Freiser, B.S.,
Generation and reactions of atomic metal anions in the gas phase. Determination of the heterolytic and homolytic bond energies of VH, VrH, FeH, CoH, and MoH,
J. Am. Chem. Soc., 1985, 107, 4379. [all data]