Pyrimidine, 4,6-dimethyl-
- Formula: C6H8N2
- Molecular weight: 108.1411
- IUPAC Standard InChIKey: LSBIUXKNVUBKRI-UHFFFAOYSA-N
- CAS Registry Number: 1558-17-4
- Chemical structure:
View 3d structure (requires JavaScript / HTML 5) - Other names: 4,6-Dimethylpyrimidine

Phase change data

Data compiled as indicated in comments:
BS - Robert L. Brown and Stephen E. Stein
TRC - Thermodynamics Research Center, NIST Boulder Laboratories, Chris Muzny director
Quantity | Value | Units | Method | Reference | Comment |
---|---|---|---|---|---|
Tboil | 427.2 | K | N/A | Aldrich Chemical Company Inc., 1990 | BS |
Tboil | 432. | K | N/A | Hauser and Manyik, 1953 | Uncertainty assigned by TRC = 6. K; TRC |
Reduced pressure boiling point
Tboil (K) | Pressure (bar) | Reference | Comment |
---|---|---|---|
432.7 | 1.01 | Weast and Grasselli, 1989 | BS |

Gas phase ion energetics data

Data compiled by: Michael M. Meot-Ner (Mautner)
Proton affinity at 298K
Proton affinity (kJ/mol) | Reference |
---|---|
928. ± 1. | Thomas and Morrison, 2000 |

Van Den Dool and Kratz RI, polar column, temperature ramp

View large format table.

Column type Active phase I Reference Comment
CapillaryDB-Wax1363.Shimoda, Peralta, et al., 199660. m/0.25 mm/0.25 μm, He, 3. K/min; Tstart: 50. C; Tend: 230. C

Normal alkane RI, polar column, custom temperature program

View large format table.

Column type Active phase I Reference Comment
CapillaryInnowax1381.Ito and Mori, 200430. m/0.25 mm/0.50 μm, Helium; Program: 40 0C (2 min) 10 0C/min -> 100 0C 3 0C/min -> 160 0C 5 0C/min -> 260 0C (10 min)

References

Aldrich Chemical Company Inc., 1990
Aldrich Chemical Company Inc.,
Catalog Handbook of Fine Chemicals, Aldrich Chemical Company, Inc., Milwaukee WI, 1990, 1. [all data]
Hauser and Manyik, 1953
Hauser, C.R.; Manyik, R.,
Synthesis of 5-Phenyl-4,6-dimethyl-2-pyrimidinol and Derivatives from the Cycliaation of Urea with 3-Phenyl-2,4-Pentanedione,
J. Org. Chem., 1953, 18, 588-93. [all data]
Weast and Grasselli, 1989
CRC Handbook of Data on Organic Compounds, 2nd Editon, Weast,R.C and Grasselli, J.G., ed(s)., CRC Press, Inc., Boca Raton, FL, 1989, 1. [all data]
Thomas and Morrison, 2000
Thomas, P.D.; Morrison, R.J.S.,
Measurement of the proton affinities of some methyl substituted pyrimidines via the kinetic method on a pentaqudrupole mass spectrometer,
Int. J. Mass Spectrom., 2000, 194, 133. [all data]