N,N'-Dithiobisdiethylamine
- Formula: C8H20N2S2
- Molecular weight: 208.388
- IUPAC Standard InChIKey: REOGMQUIPSUVSU-UHFFFAOYSA-N
- CAS Registry Number: 15575-30-1
- Chemical structure:
View 3d structure (requires JavaScript / HTML 5) - Permanent link for this species. Use this link for bookmarking this species for future reference.

Gas phase thermochemistry data

Data compiled by: Hussein Y. Afeefy, Joel F. Liebman, and Stephen E. Stein
Quantity | Value | Units | Method | Reference | Comment |
---|---|---|---|---|---|
ΔfH°gas | -69.5 ± 8.6 | kJ/mol | Cm | Claydon and Mortimer, 1962 | Reanalyzed by Cox and Pilcher, 1970, Original value = -70.3 ± 0.8 kJ/mol |

Condensed phase thermochemistry data

Data compiled by: Hussein Y. Afeefy, Joel F. Liebman, and Stephen E. Stein
Quantity | Value | Units | Method | Reference | Comment |
---|---|---|---|---|---|
ΔfH°liquid | -122.2 ± 7.5 | kJ/mol | Cm | Claydon and Mortimer, 1962 | Reanalyzed by Cox and Pilcher, 1970, Original value = -123. ± 6.7 kJ/mol |

Reaction thermochemistry data

Data compiled by: Hussein Y. Afeefy, Joel F. Liebman, and Stephen E. Stein
Individual Reactions
By formula: C8H20N2S2 + 2C4H12ClN = Cl2S2 + 4C4H11N
Quantity | Value | Units | Method | Reference | Comment |
---|---|---|---|---|---|
ΔrH° | 365.3 ± 2.9 | kJ/mol | Cm | Claydon and Mortimer, 1962 | liquid phase; Reanalyzed by Cox and Pilcher, 1970, Original value = 368. ± 3. kJ/mol |

References

Claydon and Mortimer, 1962
Claydon, A.P.; Mortimer, C.T.,
Heats of formation and bond energies. Part VIII. Diethylaminotrimethylsilane, NN'-dithiodiethylamine, NN'-thionylbisdiethylamine, and NN'-sulphurylbisdiethylamine,
J. Chem. Soc., 1962, 3212-3216. [all data]
Cox and Pilcher, 1970
Cox, J.D.; Pilcher, G.,
Thermochemistry of Organic and Organometallic Compounds, Academic Press, New York, 1970, 1-636. [all data]