Lithium trifluoroberyllate
- Formula: BeF3Li
- Molecular weight: 72.948
- CAS Registry Number: 15552-34-8

Gas phase thermochemistry data

Quantity | Value | Units | Method | Reference | Comment |
---|---|---|---|---|---|
ΔfH°gas | -887.01 | kJ/mol | Review | Chase, 1998 | Data last reviewed in December, 1962 |
Quantity | Value | Units | Method | Reference | Comment |
S°gas,1 bar | 267.41 | J/mol*K | Review | Chase, 1998 | Data last reviewed in December, 1962 |
Gas Phase Heat Capacity (Shomate Equation)
Cp° = A + B*t + C*t2 + D*t3 +
E/t2
H° − H°298.15= A*t + B*t2/2 +
C*t3/3 + D*t4/4 − E/t + F − H
S° = A*ln(t) + B*t + C*t2/2 + D*t3/3 −
E/(2*t2) + G
Cp = heat capacity (J/mol*K)
H° = standard enthalpy (kJ/mol)
S° = standard entropy (J/mol*K)
t = temperature (K) / 1000.
View plot Requires a JavaScript / HTML 5 canvas capable browser.
Temperature (K) | 2000. to 6000. |
---|---|
A | 106.8430 |
B | 0.693121 |
C | -0.139962 |
D | 0.009679 |
E | -7.803411 |
F | -940.5758 |
G | 364.1574 |
H | -887.0080 |
Reference | Chase, 1998 |
Comment | Data last reviewed in December, 1962 |

Condensed phase thermochemistry data

Quantity Value Units Method Reference Comment
Δfliquid-1634.33kJ/molReviewChase, 1998Data last reviewed in December, 1962
Quantity Value Units Method Reference Comment
liquid,1 bar111.68J/mol*KReviewChase, 1998Data last reviewed in December, 1962
Quantity Value Units Method Reference Comment
Δfsolid-1651.84kJ/molReviewChase, 1998Data last reviewed in December, 1962
Quantity Value Units Method Reference Comment
solid89.24J/mol*KReviewChase, 1998Data last reviewed in December, 1962

Liquid Phase Heat Capacity (Shomate Equation)

Cp° = A + B*t + C*t2 + D*t3 + E/t2
H° − H°298.15= A*t + B*t2/2 + C*t3/3 + D*t4/4 − E/t + F − H
S° = A*ln(t) + B*t + C*t2/2 + D*t3/3 − E/(2*t2) + G
    Cp = heat capacity (J/mol*K)
    H° = standard enthalpy (kJ/mol)
    S° = standard entropy (J/mol*K)
    t = temperature (K) / 1000.

View plot Requires a JavaScript / HTML 5 canvas capable browser.

View table.

Temperature (K) 650. - 2000.
A 158.9920
B -7.512038×10-8
C 5.444974×10-8
D -1.286199×10-8
E -2.160485×10-9
F -1687.918
G 286.1316
H -1634.325
ReferenceChase, 1998
Comment Data last reviewed in December, 1962

Solid Phase Heat Capacity (Shomate Equation)

Cp° = A + B*t + C*t2 + D*t3 + E/t2
H° − H°298.15= A*t + B*t2/2 + C*t3/3 + D*t4/4 − E/t + F − H
S° = A*ln(t) + B*t + C*t2/2 + D*t3/3 − E/(2*t2) + G
    Cp = heat capacity (J/mol*K)
    H° = standard enthalpy (kJ/mol)
    S° = standard entropy (J/mol*K)
    t = temperature (K) / 1000.

View plot Requires a JavaScript / HTML 5 canvas capable browser.

View table.

Temperature (K) 298. - 650.
A 54.39116
B 125.5225
C -0.002265
D 0.000681
E 0.000045
F -1673.642
G 117.6424
H -1651.843
ReferenceChase, 1998
Comment Data last reviewed in December, 1962

References

Chase, 1998
Chase, M.W., Jr.,
NIST-JANAF Themochemical Tables, Fourth Edition,
J. Phys. Chem. Ref. Data, Monograph 9, 1998, 1-1951. [all data]