Piperazine, 1-[3-(trifluoromethyl)phenyl]-
- Formula: C11H13F3N2
- Molecular weight: 230.2295
- IUPAC Standard InChIKey: KKIMDKMETPPURN-UHFFFAOYSA-N
- CAS Registry Number: 15532-75-9
- Chemical structure:
View 3d structure (requires JavaScript / HTML 5) - Other names: 1-[3-(Trifluoromethyl)phenyl]piperazine; TFMPP; 3-Trifluoromethyl phenyl piper; N-(α,α,α-trifluoro-3-tolyl)piperazine

Van Den Dool and Kratz RI, non-polar column, temperature ramp

Column type | Active phase | I | Reference | Comment |
---|---|---|---|---|
Capillary | VF-5MS | 1558. | Tretyakov, 2014 | 30. m/0.25 mm/0.25 μm, He; Tstart: 60. C; Tend: 270. C |

References

Tretyakov, 2014
Tretyakov, K.V.,
Retention Data. NIST Mass Spectrometry Data Center., NIST Mass Spectrometry Data Center, 2014. [all data]