1-Methyl-5-fluorouracil
- Formula: C5H5FN2O2
- Molecular weight: 144.1038
- IUPAC Standard InChIKey: PPCVYQHUOMISIG-UHFFFAOYSA-N
- CAS Registry Number: 155-16-8
- Chemical structure:
View 3d structure (requires JavaScript / HTML 5) - Permanent link for this species. Use this link for bookmarking this species for future reference.

Phase change data

Data compiled by: William E. Acree, Jr., James S. Chickos
Enthalpy of sublimation
ΔsubH (kJ/mol) | Temperature (K) | Method | Reference |
---|---|---|---|
116. ± 2. | 381. to 423. | TE | Brunetti, Portalone, et al., 2002 |
126. ± 8. | 480. to 515. | HSA | Nowak, Szczepaniak, et al., 1978 |

References

Brunetti, Portalone, et al., 2002
Brunetti, B.; Portalone, G.; Piacente, V.,
Sublimation Thermodynamic Parameters for 5-Fluorouracil and Its 1-Methyl and 1,3-Dimethyl Derivatives from Vapor Pressure Measurements,
J. Chem. Eng. Data, 2002, 47, 1, 17-19, https://doi.org/10.1021/je010037e
. [all data]
Nowak, Szczepaniak, et al., 1978
Nowak, M.J.; Szczepaniak, K.; Barski, A.; Shugar, D.Z.,
Z. Naturforsch. C, 1978, 33C, 876. [all data]