Zirconium iodide

Condensed phase thermochemistry data

Quantity Value Units Method Reference Comment
Δfliquid-234.24kJ/molReviewChase, 1998Data last reviewed in June, 1962
Quantity Value Units Method Reference Comment
liquid,1 bar186.16J/mol*KReviewChase, 1998Data last reviewed in June, 1962
Quantity Value Units Method Reference Comment
Δfsolid-259.41kJ/molReviewChase, 1998Data last reviewed in June, 1962
Quantity Value Units Method Reference Comment
solid150.23J/mol*KReviewChase, 1998Data last reviewed in June, 1962

Liquid Phase Heat Capacity (Shomate Equation)

Cp° = A + B*t + C*t2 + D*t3 + E/t2
H° − H°298.15= A*t + B*t2/2 + C*t3/3 + D*t4/4 − E/t + F − H
S° = A*ln(t) + B*t + C*t2/2 + D*t3/3 − E/(2*t2) + G
    Cp = heat capacity (J/mol*K)
    H° = standard enthalpy (kJ/mol)
    S° = standard entropy (J/mol*K)
    t = temperature (K) / 1000.

View plot Requires a JavaScript / HTML 5 canvas capable browser.

View table.

Temperature (K) 700. - 2000.
A 36.52197
B 87.18159
C -0.122615
D 0.040129
E -0.030464
F -242.7511
G 219.6654
H -234.2391
ReferenceChase, 1998
Comment Data last reviewed in June, 1962

Solid Phase Heat Capacity (Shomate Equation)

Cp° = A + B*t + C*t2 + D*t3 + E/t2
H° − H°298.15= A*t + B*t2/2 + C*t3/3 + D*t4/4 − E/t + F − H
S° = A*ln(t) + B*t + C*t2/2 + D*t3/3 − E/(2*t2) + G
    Cp = heat capacity (J/mol*K)
    H° = standard enthalpy (kJ/mol)
    S° = standard entropy (J/mol*K)
    t = temperature (K) / 1000.

View plot Requires a JavaScript / HTML 5 canvas capable browser.

View table.

Temperature (K) 298. - 700.
A 89.77400
B 13.56005
C -4.823022
D 1.332182
E 0.073323
F -286.4818
G 255.4441
H -259.4084
ReferenceChase, 1998
Comment Data last reviewed in June, 1962

References

Chase, 1998
Chase, M.W., Jr., NIST-JANAF Themochemical Tables, Fourth Edition, J. Phys. Chem. Ref. Data, Monograph 9, 1998, 1-1951. [all data]