Thiophene, 2-ethyltetrahydro-
- Formula: C6H12S
- Molecular weight: 116.224
- IUPAC Standard InChIKey: FQAXENNJSLPYOP-UHFFFAOYSA-N
- CAS Registry Number: 1551-32-2
- Chemical structure:
View 3d structure (requires JavaScript / HTML 5) - Other names: Tetrahydro-2-ethylthiophene; 2-Ethyltetrahydrothiophene; 2-Ethylthiophane; 2-Ethyl-thiacyclopentane; 2-Ethyl-thiolane

Phase change data

Data compiled by: William E. Acree, Jr., James S. Chickos
Enthalpy of vaporization
ΔvapH (kJ/mol) | Temperature (K) | Method | Reference | Comment |
---|---|---|---|---|
42.6 | 348. | A | Stephenson and Malanowski, 1987 | Based on data from 333. to 488. K. See also Dykyj, 1972 and Dykyj, Svoboda, et al., 1999. |

Kovats' RI, non-polar column, isothermal

Column type | Active phase | Temperature (C) | I | Reference | Comment |
---|---|---|---|---|---|
Capillary | OV-101 | 100. | 945. | Gal'pern, Gollandskikh, et al., 1976 | H2; Column length: 100. m; Column diameter: 0.25 mm |
Capillary | Squalane | 120. | 934. | Agr, Tesaric, et al., 1973 | |
Capillary | Squalane | 86. | 930. | Agr, Tesaric, et al., 1973 | |
Capillary | Squalane | 120. | 934. | Agrawal, Tesarík, et al., 1972 | N2, Celite 545; Column length: 50. m; Column diameter: 0.3 mm |
Capillary | Squalane | 86. | 930. | Agrawal, Tesarík, et al., 1972 | N2, Celite 545; Column length: 50. m; Column diameter: 0.3 mm |

Normal alkane RI, non-polar column, temperature ramp

Column type | Active phase | I | Reference | Comment |
---|---|---|---|---|
Capillary | CP-Sil 5 | 926. | Damste, van Dalen, et al., 1988 | 25. m/0.32 mm/0.45 μm, Helium, 0. C @ 5. min, 3. K/min; Tend: 300. C |
Capillary | CP-Sil 5 | 926. | Damste, van Dalen, et al., 1988 | 25. m/0.32 mm/0.45 μm, Helium, 0. C @ 5. min, 3. K/min; Tend: 300. C |
Capillary | CP-Sil 5 | 928. | Damste, van Dalen, et al., 1988 | 25. m/0.32 mm/0.45 μm, Helium, 0. C @ 5. min, 3. K/min; Tend: 300. C |
Capillary | CP Sil 5 CB | 926. | Damste, Kock-van Dalen, et al., 1988 | 25. m/0.32 mm/0.45 μm, He, 3. K/min; Tstart: 50. C; Tend: 300. C |
Capillary | OV-101 | 945. | Limin, Jichun, et al., 1988 | 75. C @ 8. min, 2. K/min; Column length: 25. m; Column diameter: 0.25 mm; Tend: 130. C |

Normal alkane RI, non-polar column, custom temperature program

Column type | Active phase | I | Reference | Comment |
---|---|---|---|---|
Capillary | Methyl Silicone | 926. | Farkas, Héberger, et al., 2004 | Program: not specified |

References

Stephenson and Malanowski, 1987
Stephenson, Richard M.; Malanowski, Stanislaw,
Handbook of the Thermodynamics of Organic Compounds, 1987, https://doi.org/10.1007/978-94-009-3173-2
. [all data]
Dykyj, 1972
Dykyj, J.,
Petrochemia, 1972, 12, 1, 13. [all data]
Dykyj, Svoboda, et al., 1999
Dykyj, J.; Svoboda, J.; Wilhoit, R.C.; Frenkel, M.L.; Hall, K.R.,
Vapor Pressure of Chemicals: Part A. Vapor Pressure and Antoine Constants for Hydrocarbons and Sulfur, Selenium, Tellurium and Hydrogen Containing Organic Compounds, Springer, Berlin, 1999, 373. [all data]
Gal'pern, Gollandskikh, et al., 1976
Gal'pern, G.D.; Gollandskikh, N.I.; Gordadze, G.N.,
Application of methylene-insertion reactions to cyclic sulphides (C4H8S, C5H10S and C6H12S) to produce standard compounds for gas chromatography,
J. Chromatogr., 1976, 124, 1, 43-51, https://doi.org/10.1016/S0021-9673(00)87835-8
. [all data]
Agr, Tesaric, et al., 1973
Agr, X.X.; Tesaric, K.; Janak, J.,
Will be entered later,
J. Chromatogr., 1973, 95, 207-215. [all data]
Agrawal, Tesarík, et al., 1972
Agrawal, B.B.; Tesarík, K.; Janák, J.,
Gas chromatographic characterization of sulphur compounds in the 93-162° gasoline cut from Romashkino crude oil using Kováts retention indices,
J. Chromatogr., 1972, 65, 1, 207-215, https://doi.org/10.1016/S0021-9673(00)86933-2
. [all data]
Damste, van Dalen, et al., 1988
Damste, J.S.S.; van Dalen, A.C.K.; de Leeuw, J.W.; Schenck, P.A.,
Identification of homologous series of alkylated thiophenes, thiolanes, thianes and benzothiophenes present in pyrolisates of sulfur-rich kerogenes,
J. Chromatogr., 1988, 435, 435-452, https://doi.org/10.1016/S0021-9673(01)82208-1
. [all data]
Damste, Kock-van Dalen, et al., 1988
Damste, J.S.S.; Kock-van Dalen, A.C.; de Leeuw, J.W.; Schenk, P.A.,
Identification of homologous series of alkylated thiophenes, thiolanes, thianes and benzothiophenes present in pyrolysates of sulphur-rich kerogens,
J. Chromatogr., 1988, 435, 435-452, https://doi.org/10.1016/S0021-9673(01)82208-1
. [all data]
Limin, Jichun, et al., 1988
Limin, Z.; Jichun, J.; Shiyi, L.; Keman, S.,
Identification of sulfur ethers in Jianghan naphtha fractions,
Acta Petrolei Sinica, 1988, 4, 1, 100-107. [all data]
Farkas, Héberger, et al., 2004
Farkas, O.; Héberger, K.; Zenkevich, I.G.,
Quantitative structure-retention relationships. XIV. Prediction of gas chromatographic retention indices for saturated O-, N-, and S-heterocyclic compounds,
Chemom. Intell. Lab. Syst., 2004, 72, 2, 173-184, https://doi.org/10.1016/j.chemolab.2004.01.012
. [all data]