2-Methyl-1-pentanol, heptafluorobutyrate
- Formula: C10H13F7O2
- Molecular weight: 298.1978
- IUPAC Standard InChIKey: OAVKNMKBMUDCCL-UHFFFAOYSA-N
- CAS Registry Number: 155089-98-8
- Chemical structure:
View 3d structure (requires JavaScript / HTML 5) - Other names: 2-Hexanol, heptafluorobutyrate; 1-Heptafluorobutyryloxy-2-methylpentane

Van Den Dool and Kratz RI, non-polar column, custom temperature program

Column type | Active phase | I | Reference | Comment |
---|---|---|---|---|
Capillary | VF-5MS | 866.5 | Tret'yakov, 2008 | 30. m/0.25 mm/0.25 μm, He; Program: Multi-step temperature program; T(initial)=60C; T(final)=270C |
Capillary | VF-5MS | 886.9 | Tret'yakov, 2008 | 30. m/0.25 mm/0.25 μm, He; Program: Multi-step temperature program; T(initial)=60C; T(final)=270C |

References

Tret'yakov, 2008
Tret'yakov, K.V.,
Retention Data. NIST Mass Spectrometry Data Center., NIST Mass Spectrometry Data Center, 2008. [all data]