Butyl sulfuric acid
- Formula: C4H10O4S
- Molecular weight: 154.185
- IUPAC Standard InChIKey: ZTHQBROSBNNGPU-UHFFFAOYSA-N
- CAS Registry Number: 15507-13-8
- Chemical structure:
View 3d structure (requires JavaScript / HTML 5) - Permanent link for this species. Use this link for bookmarking this species for future reference.

Condensed phase thermochemistry data

Data compiled by: Hussein Y. Afeefy, Joel F. Liebman, and Stephen E. Stein
Quantity | Value | Units | Method | Reference | Comment |
---|---|---|---|---|---|
ΔfH°liquid | -887. ± 6. | kJ/mol | Cm | Markitanova, Barsukov, et al., 1981 | Sulfation |

Reaction thermochemistry data

Data compiled by: Hussein Y. Afeefy, Joel F. Liebman, and Stephen E. Stein
Individual Reactions
By formula: C4H10O + ClHO3S = C4H10O4S + HCl
Quantity | Value | Units | Method | Reference | Comment |
---|---|---|---|---|---|
ΔrH° | 58. ± 1. | kJ/mol | Cm | Markitanova, Barsukov, et al., 1981 | liquid phase; solvent: Dichloromethane; Sulfation |

References

Markitanova, Barsukov, et al., 1981
Markitanova, L.I.; Barsukov, I.I.; Passet, B.V.,
Determination of heat of sulfation by calorimetric titration,
J. Gen. Chem. USSR, 1981, 51, 1286-1289. [all data]