4-Acetoxycinnamic acid
- Formula: C11H10O4
- Molecular weight: 206.1947
- IUPAC Standard InChIKey: BYHBHNKBISXCEP-QPJJXVBHSA-N
- CAS Registry Number: 15486-19-8
- Chemical structure:
View 3d structure (requires JavaScript / HTML 5) - Other names: p-Acetoxycinnamic acid; 2-Propenoic acid, 3-[4-(acetyloxy)phenyl]-; Cinnamic acid, p-hydroxy-, acetate

Condensed phase thermochemistry data

Data compiled by: Hussein Y. Afeefy, Joel F. Liebman, and Stephen E. Stein
Quantity | Value | Units | Method | Reference | Comment |
---|---|---|---|---|---|
ΔcH°solid | -5076.31 | kJ/mol | Ccb | Verkade, 1926 | Corresponding ΔfHºsolid = -681.45 kJ/mol (simple calculation by NIST; no Washburn corrections) |

References

Verkade, 1926
Verkade, P.E.,
Verbrandingswarmten van plaatsings-isomere benzol-derivaten en de theorie der geinduceerde alterneeren de polatiteit,
Verslag Akad. Wetenschappen Amsterdam, 1926, 35, 492-504. [all data]